{"text_format":"1","workbook":"xlsx","n_sheets":15,"sheets":["MENY","JAN","FEB","MAR","APR","MAI","JUN","JUL","AUG","SEP","OKT","NOV","DES","ÅRET","HJELP"],"not_rendered":{"charts":0,"images":0,"macros":1,"external_links":0,"defined_names":15,"comments":13,"pivot_tables":0},"unopened":[],"bounds":{"document_bytes":16777216,"sheet_cells":100000,"rows_first":2000,"rows_last":500,"rows_between":2000,"halvings":0,"cell_chars":16384,"cell_head_chars":4096},"cells_cut":0,"cells_raw":0,"read":"whole","date_system":"1900"}

{"sheet":"MENY","index":0,"n_rows":29,"n_cols":19,"rows_kept":29,"cut":false,"hidden":false,"merged":[[3,3,3,6],[4,3,4,6],[6,3,6,6],[10,1,10,3],[7,1,7,8],[5,3,5,6]]}
[null,"Meny","Januar","Februar","Mars","April","Mai","Juni","Året",null,null,null,null,"Fraværskoder",null,{"$f":"IF(I4<=R1,I4,R2)","v":2019},"lisens til",{"$f":"D28","v":2024}]
[null,"HJELP","Juli","August","September","Oktober","November","Desember",null,null,null,null,null,0,"Ordinær",null,"låst år",{"$f":"R1","v":2024}]
[null,null,null,null,"Timeregistrering",null,null,"Stillingsbrøk",1,null,null,null,null,{"$f":"N2+1","v":1},"Avspasere",null,{"$f":"DATE(P1,1,1)","v":"2019-01-01"}]
[null,null,"Bedrift:","Min bedrift",null,null,null,"År :",2019,null,null,null,null,{"$f":"N3+1","v":2},"Ferie"]
[null,null,"Arbeidstaker:","Min timeliste",null,null,null,null,1,null,null,null,null,3,"Tjeneste"]
[null,null,"Leder:","Leder",null,null,null,null,1,null,null,null,null,4,"Plussdag"]
[null,null,null,"MENY",null,null,null,null,null,null,null,null,null,5,"Helligdag"]
[null,"Alle gule felt er åpne for endringer",null,null,null,null,null,null,null,null,null,null,null,6,"Perm-m/lønn"]
[null,null,"Før du tar programmet i bruk, kontroller om grunnlagsdata er korrekte.",null,null,null,null,null,null,null,null,null,null,7,"Perm-u/lønn",1,"Man"]
[null,null,null,null,"Grunnlagsdata",null,null,null,null,null,null,null,null,8,"Sykemelding",2,"Tirs"]
[null,"Datoformat: dd.mm.åå",null,null,"Ordinær arbeidsdag kl. fra til ",null,null,null,null,null,null,null,null,9,"Egenmelding",3,"Ons"]
[null,"Årstid","Start","Slutt","Start","Slutt","Desimaltid","Uketid",null,"Hvis du trekkes for matpause",null,null,null,10,"Sykt barn",4,"Tors"]
[null,"Sommer","2017-05-15","2017-09-14","08:00:00","15:30:00",{"$f":"(F13-E13)*24","v":7.5000000000000018},{"$f":"G13*5","v":37.500000000000007},"00:00:00","< - matpause trekk sommertid",null,null,null,11,"Feil kode",5,"Fre"]
[null,"Vinter",{"$f":"D13+1","v":"2017-09-15"},{"$f":"C13-1","v":"2017-05-14"},"08:00:00","15:30:00",{"$f":"(F14-E14)*24","v":7.5000000000000018},{"$f":"G14*5","v":37.500000000000007},"00:00:00","< - matpause trekk vintertid",null,null,null,12,"Overtid",6,"Lør"]
[null,"Hele året",null,"Kjernetid: ","09:00:00","15:00:00","<- Normalverdi fra 10:00 til 14:00",null,null,null,null,null,null,13,"Feil kode"]
[null,null,null,null,"Overførte timer fra forrige år, i desimaltid: ",null,"Faste feriedager",null,25,null,null,null,null,14,"Feil kode"]
[null,null,null,null,"Avtalefestede feriedager pr år : ",{"$f":"I16+I17","v":25},"Seniorferie 60+",null,0,null,null,null,null,15,"Feil kode"]
[null,null,null,null,"Ev. ekstra feriedager pr år med lønn: ",0,null,"ferie m/lønn dette år :",{"$f":"F18+F19","v":0},null,null,null,null,16,"Feil kode","Sommertid start",{"$f":"DATE(P1,R18,S18)","v":"2019-05-15"},{"$f":"MONTH(C13)","v":5},{"$f":"DAY(C13)","v":15}]
[null,null,null,null,"Overførte feriedager fra i fjor : ",null,null,"Ferie m/lønnstrekk:",{"$f":"F17","v":25},null,null,null,null,17,"Feil kode","Sommertid slutt",{"$f":"DATE(P1,R19,S19)","v":"2019-09-14"},{"$f":"MONTH(D13)","v":9},{"$f":"DAY(D13)","v":14}]
[null,null,null,null,"Sum feriedager disponibel dette år : ",{"$f":"SUM(F17:F19)","v":25},null,null,null,null,null,null,null,null,null,"Vintertid start",{"$f":"Q19+1","v":"2019-09-15"}]
[null,"© Ole Jørgen Klaussen",null,null,null,null,null,null,null,null,null,null,null,null,null,"vintertid slutt",{"$f":"Q18-1","v":"2019-05-14"}]
[]
[null,"            VIKTIG !  LES  \"HJELP\" FØR DU FORTSETTER Å BRUKE DETTE PROGRAMMET"]
[]
[]
[]
[]
[null,"Programlisens går til ",null,2024]
[null,"© Ole Jørgen Klaussen"]

{"sheet":"JAN","index":1,"n_rows":64,"n_cols":37,"rows_kept":64,"cut":false,"hidden":false,"merged":[[7,7,7,8],[8,15,8,16],[9,15,9,16],[1,28,2,33],[5,7,6,16],[2,1,2,6],[6,3,6,4],[2,15,2,16],[5,19,5,22],[21,15,21,16],[7,15,7,16],[11,15,11,16],[12,15,12,16],[13,15,13,16],[10,15,10,16],[15,15,15,16],[14,15,14,16],[16,15,16,16],[17,15,17,16],[18,15,18,16],[19,15,19,16],[20,15,20,16],[22,15,22,16],[23,15,23,16],[24,15,24,16],[25,15,25,16],[26,15,26,16],[33,15,33,16],[34,15,34,16],[27,15,27,16],[28,15,28,16],[29,15,29,16],[30,15,30,16],[31,15,31,16],[32,15,32,16],[56,6,56,10],[56,14,56,16],[62,6,62,10],[59,14,59,16],[35,15,35,16],[36,15,36,16],[37,15,37,16],[38,15,38,16],[55,0,55,16],[51,0,51,16],[52,0,52,16],[53,0,53,16],[54,0,54,16]]}
["Meny","JAN","FEB","MAR","APR","MAI","JUN",null,null,null,null,null,null,null,null,null,"Hjelp","Viktig når det gjelder overtid"]
["Året","JUL","AUG","SEP","OKT","NOV","DES",null,null,null,null,null,null,null,null,"Dato",null,"For at føringer av aktiv arbeidstid skal bli riktig er det"]
[null,{"$f":"MENY!D4","v":"Min bedrift"},null,null,null,null,null,null,"Januar - ",null,null,null,null,{"$f":"MENY!P1","v":2019},null,{"$f":"TODAY()","v":"2018-11-30"},null,"nødvendig at all arbeidstid registreres. Dette gjelder  også"]
[null,"Timeliste","Navn:",{"$f":"MENY!D5","v":"Min timeliste"},null,null,"Sommer",null,null,null,"Stillingsbrøk:",{"$f":"MENY!I5","v":1},null,"Vinter",null,null,null,"overtid. Registrer  når du kommer (inn) og når du går (ut)",null,null,null,null,null,null,null,null,null,null,null,null,null,null,null,null,null,"MERK!"]
[null,null,"Sommerlukking fra/til:",null,{"$f":"MENY!Q18","v":"2019-05-15"},{"$f":"MENY!Q19","v":"2019-09-14"},{"$f":"(MENY!F13-MENY!E13-MENY!I13)*MENY!I5","v":"07:30:00"},null,{"$f":"MENY!I13","v":"00:00:00"},"  <-arbeidstid->",null,null,{"$f":"MENY!I14","v":"00:00:00"},{"$f":"(MENY!F14-MENY!E14-MENY!I14)*MENY!I5","v":"07:30:00"},null,null,null,"Dersom noe av tiden skal utbetales i overtid, bruk kode 12",null,null,null,null,null,null,null,null,null,null,null,null,null,null,null,null,null,"Les her"]
["År ",null,null,null,null,null,null,"Fyll ut i arbeids og fraværskode : 0=ordinær  1=Avspasere  2=Ferie  3=Tjeneste  4=Plussdag  5=Helligdag  6=Perm M/lønn  7=Perm U/lønn  8=Sykemelding  9=Egenmelding 10=Sykt barn 11=Ordinær+ , 12 = plusstid som overtid",null,null,null,null,null,null,null,null,null,"for arbeidskode.   Fordeling mellom 50% og 100% skjer",null,"Arbeidsdata",null,null,null,null,null,null,null,null,6,7,8,9,10,null,null,"Syke-","Stillings"]
[{"$f":"N3","v":2019},{"$f":"WEEKNUM(A9)+MENY!I12","v":1},"I dag","Fravær pr dag",null,"I dag",null,null,null,null,null,null,null,null,null,null,null,"automatisk, men kan  også endres.",null,null,null,null,null,6,7,8,9,10,12,13,14,15,16,null,null,"melding","brøk"]
["DATO","UKENR                               og DAG","Kom","Ut","Inn","Gikk","Ordinær","Arbeids og fraværskode",null,"Fravær",0.5,1,1.33,"Balanse","Timer i dag","Merknad ",null,"Huskeliste",null,"Arbeids dag","Avsp","Ferie","Tjeneste","Perm m-lønn","Perm u-lønn","Sykemelding","Egenmelding","Sykt barn","Perm m-lønn","Perm u-lønn","Sykemelding","Egenmelding","Sykt barn","Ordinær arbeidstid","Trekk for matpause","i prosent andel"]
[{"$f":"DATE(MENY!P1,1,1)","v":"2019-01-01"},{"$f":"IF(WEEKDAY(A10,2)=1,WEEKNUM(A9)*-1-MENY!$I$12,IF(WEEKDAY(A9,2)<7,LOOKUP(WEEKDAY(A9,2),MENY!$P$8:$P$14,MENY!$Q$8:$Q$14),\"\"))","v":"Tirs"},null,null,null,null,{"$f":"IF(H9=11,F9-C9-(E9-D9),IF(B9=\"Lør\",0,IF(H9=4,0,IF(H9=3,IF(T9>0,W9,\"\"),IF(H9=1,0, IF(C9>0,  AH9,       \"\"))))))","v":""},{"$f":"IF(B9=\"Lør\",IF(C9>0,4,0),0)","v":0},{"$f":"IF(H9=11,\"Ordinær +\",IF(T9=1,IF(H9>0,LOOKUP(H9,MENY!$N$2:O18,MENY!$O$2:$O$18),IF(C9>0,IF(B9=\"Lør\",\"-\",\"Ordinær\"),\"-\")),\"Søndag\"))","v":"-"},null,{"$f":"IF(H9=12,IF(N9>=4,4,N9),0)","v":0},{"$f":"IF(H9=12,IF(N9>K9,N9-4,0),0)","v":0},null,{"$f":"IF(H9=11,0,IF(T9=1,IF(H9=4,((F9-C9)-(E9-D9))*24,IF(C9>0,(F9-C9-(E9-D9)-G9-AI9)*24,0)),0))","v":0},{"$f":"IF(F9>0,G9*24+N9,\"\")","v":""},null,null,{"$f":"IF(O9=\"\",\"\",\"Husk, fordel timer til prosjekter\")","v":""},null,{"$f":"IF(WEEKDAY(A9-1)<7,1,0)","v":1},{"$f":"IF(B9=\"Lør\",\"\",IF(T9=1,IF(H9=1,AH9,0),0))","v":"00:00:00"},{"$f":"IF(T9=1,IF(B9=\"lør\",\"\",IF(H9=2,1,0)),\"\")","v":0},{"$f":"IF(T9=1,IF(H9=3,AH9,0),0)","v":"00:00:00"},{"$f":"IF(B9=\"lør\",\"\",IF(T9=1,IF(H9=6,AH9,0),0))","v":"00:00:00"},{"$f":"IF(B9=\"Lør\",\"\",IF(T9=1,IF(H9=7,AH9,0),0))","v":"00:00:00"},{"$f":"IF(AJ9>0,IF(C9>0,    (AH9*AJ9)/(1-AJ9),0),           IF(B9=\"Lør\",\"\",IF(T9=1,IF(H9=8,AH9,0),0)))","v":"00:00:00"},{"$f":"IF(B9=\"Lør\",\"\",IF(T9=1,IF(H9=9,AH9,0),0))","v":"00:00:00"},{"$f":"IF(B9=\"Lør\",\"\",IF(T9=1,IF(H9=10,AH9,0),0))","v":"00:00:00"},{"$f":"IF(J9=6,N9,0)","v":0},{"$f":"IF(J9=7,N9,0)","v":0},{"$f":"IF(J9=8,N9,0)","v":0},{"$f":"IF(J9=9,N9,0)","v":0},{"$f":"IF(J9=10,N9,0)","v":0},{"$f":"((IF(A9<$F$5+1,IF(A9>$E$5-1,$G$5,$N$5),$N$5))*(1-AJ9))*(AK9)","v":"07:30:00"},{"$f":"IF(A9<$F$5+1,IF(A9>$E$5-1,$I$5,$M$5),$M$5)","v":"00:00:00"},null,{"$f":"MENY!I3","v":1}]
[{"$f":"A9+1","v":"2019-01-02"},{"$f":"IF(WEEKDAY(A11,2)=1,WEEKNUM(A10)*-1-MENY!$I$12,IF(WEEKDAY(A10,2)<7,LOOKUP(WEEKDAY(A10,2),MENY!$P$8:$P$14,MENY!$Q$8:$Q$14),\"\"))","v":"Ons"},null,null,null,null,{"$f":"IF(H10=11,F10-C10-(E10-D10),IF(B10=\"Lør\",0,IF(H10=4,0,IF(H10=3,IF(T10>0,W10,\"\"),IF(H10=1,0, IF(C10>0,  AH10,       \"\"))))))","v":""},0,{"$f":"IF(H10=11,\"Ordinær +\",IF(T10=1,IF(H10>0,LOOKUP(H10,MENY!$N$2:O19,MENY!$O$2:$O$18),IF(C10>0,IF(B10=\"Lør\",\"-\",\"Ordinær\"),\"-\")),\"Søndag\"))","v":"-"},null,{"$f":"IF(H10=12,IF(N10>=4,4,N10),0)","v":0},{"$f":"IF(H10=12,IF(N10>K10,N10-4,0),0)","v":0},null,{"$f":"IF(H10=11,0,IF(T10=1,IF(H10=4,((F10-C10)-(E10-D10))*24,IF(C10>0,(F10-C10-(E10-D10)-G10-AI10)*24,0)),0))","v":0},{"$f":"IF(F10>0,G10*24+N10,\"\")","v":""},null,null,{"$f":"IF(O10=\"\",\"\",\"Husk, fordel timer til prosjekter\")","v":""},null,{"$f":"IF(WEEKDAY(A10-1)<7,1,0)","v":1},{"$f":"IF(B10=\"Lør\",\"\",IF(T10=1,IF(H10=1,AH10,0),0))","v":"00:00:00"},0,{"$f":"IF(T10=1,IF(H10=3,AH10,0),0)","v":"00:00:00"},{"$f":"IF(B10=\"lør\",\"\",IF(T10=1,IF(H10=6,AH10,0),0))","v":"00:00:00"},{"$f":"IF(B10=\"Lør\",\"\",IF(T10=1,IF(H10=7,AH10,0),0))","v":"00:00:00"},{"$f":"IF(AJ10>0,IF(C10>0,    (AH10*AJ10)/(1-AJ10),0),           IF(B10=\"Lør\",\"\",IF(T10=1,IF(H10=8,AH10,0),0)))","v":"00:00:00"},{"$f":"IF(B10=\"Lør\",\"\",IF(T10=1,IF(H10=9,AH10,0),0))","v":"00:00:00"},{"$f":"IF(B10=\"Lør\",\"\",IF(T10=1,IF(H10=10,AH10,0),0))","v":"00:00:00"},0,0,0,0,0,{"$f":"((IF(A10<$F$5+1,IF(A10>$E$5-1,$G$5,$N$5),$N$5))*(1-AJ10))*(AK10)","v":"07:30:00"},{"$f":"IF(A10<$F$5+1,IF(A10>$E$5-1,$I$5,$M$5),$M$5)","v":"00:00:00"},{"$f":"AJ9","v":0},{"$f":"AK9","v":1}]
[{"$f":"A10+1","v":"2019-01-03"},{"$f":"IF(WEEKDAY(A12,2)=1,WEEKNUM(A11)*-1-MENY!$I$12,IF(WEEKDAY(A11,2)<7,LOOKUP(WEEKDAY(A11,2),MENY!$P$8:$P$14,MENY!$Q$8:$Q$14),\"\"))","v":"Tors"},null,null,null,null,{"$f":"IF(H11=11,F11-C11-(E11-D11),IF(B11=\"Lør\",0,IF(H11=4,0,IF(H11=3,IF(T11>0,W11,\"\"),IF(H11=1,0, IF(C11>0,  AH11,       \"\"))))))","v":""},0,{"$f":"IF(H11=11,\"Ordinær +\",IF(T11=1,IF(H11>0,LOOKUP(H11,MENY!$N$2:O20,MENY!$O$2:$O$18),IF(C11>0,IF(B11=\"Lør\",\"-\",\"Ordinær\"),\"-\")),\"Søndag\"))","v":"-"},null,0,0,null,0,"",null,null,"",null,1,"00:00:00",0,"00:00:00","00:00:00","00:00:00","00:00:00","00:00:00","00:00:00",0,0,0,0,0,"07:30:00","00:00:00",{"$f":"AJ10","v":0},{"$f":"AK10","v":1}]
["2019-01-04",{"$f":"IF(WEEKDAY(A13,2)=1,WEEKNUM(A12)*-1-MENY!$I$12,IF(WEEKDAY(A12,2)<7,LOOKUP(WEEKDAY(A12,2),MENY!$P$8:$P$14,MENY!$Q$8:$Q$14),\"\"))","v":"Fre"},null,null,null,null,"",0,{"$f":"IF(H12=11,\"Ordinær +\",IF(T12=1,IF(H12>0,LOOKUP(H12,MENY!$N$2:O21,MENY!$O$2:$O$18),IF(C12>0,IF(B12=\"Lør\",\"-\",\"Ordinær\"),\"-\")),\"Søndag\"))","v":"-"},null,0,0,null,0,"",null,null,"",null,1,"00:00:00",0,"00:00:00","00:00:00","00:00:00","00:00:00","00:00:00","00:00:00",0,0,0,0,0,"07:30:00","00:00:00",0,1]
["2019-01-05",{"$f":"IF(WEEKDAY(A14,2)=1,WEEKNUM(A13)*-1-MENY!$I$12,IF(WEEKDAY(A13,2)<7,LOOKUP(WEEKDAY(A13,2),MENY!$P$8:$P$14,MENY!$Q$8:$Q$14),\"\"))","v":"Lør"},null,null,null,null,"00:00:00",0,{"$f":"IF(H13=11,\"Ordinær +\",IF(T13=1,IF(H13>0,LOOKUP(H13,MENY!$N$2:O22,MENY!$O$2:$O$18),IF(C13>0,IF(B13=\"Lør\",\"-\",\"Ordinær\"),\"-\")),\"Søndag\"))","v":"-"},null,0,0,null,0,"",null,null,"",null,1,"","","00:00:00","","","","","",0,0,0,0,0,"07:30:00","00:00:00",0,1]
["2019-01-06",{"$f":"IF(WEEKDAY(A15,2)=1,WEEKNUM(A14)*-1-MENY!$I$12,IF(WEEKDAY(A14,2)<7,LOOKUP(WEEKDAY(A14,2),MENY!$P$8:$P$14,MENY!$Q$8:$Q$14),\"\"))","v":-2},null,null,null,null,"",0,{"$f":"IF(H14=11,\"Ordinær +\",IF(T14=1,IF(H14>0,LOOKUP(H14,MENY!$N$2:O23,MENY!$O$2:$O$18),IF(C14>0,IF(B14=\"Lør\",\"-\",\"Ordinær\"),\"-\")),\"Søndag\"))","v":"Søndag"},null,0,0,null,0,"",null,null,"",null,0,"00:00:00","","00:00:00","00:00:00","00:00:00","00:00:00","00:00:00","00:00:00",0,0,0,0,0,"07:30:00","00:00:00",0,1]
["2019-01-07",{"$f":"IF(WEEKDAY(A16,2)=1,WEEKNUM(A15)*-1-MENY!$I$12,IF(WEEKDAY(A15,2)<7,LOOKUP(WEEKDAY(A15,2),MENY!$P$8:$P$14,MENY!$Q$8:$Q$14),\"\"))","v":"Man"},null,null,null,null,"",0,{"$f":"IF(H15=11,\"Ordinær +\",IF(T15=1,IF(H15>0,LOOKUP(H15,MENY!$N$2:O24,MENY!$O$2:$O$18),IF(C15>0,IF(B15=\"Lør\",\"-\",\"Ordinær\"),\"-\")),\"Søndag\"))","v":"-"},null,0,0,null,0,"",null,null,"",null,1,"00:00:00",0,"00:00:00","00:00:00","00:00:00","00:00:00","00:00:00","00:00:00",0,0,0,0,0,"07:30:00","00:00:00",0,1]
["2019-01-08",{"$f":"IF(WEEKDAY(A17,2)=1,WEEKNUM(A16)*-1-MENY!$I$12,IF(WEEKDAY(A16,2)<7,LOOKUP(WEEKDAY(A16,2),MENY!$P$8:$P$14,MENY!$Q$8:$Q$14),\"\"))","v":"Tirs"},null,null,null,null,"",0,{"$f":"IF(H16=11,\"Ordinær +\",IF(T16=1,IF(H16>0,LOOKUP(H16,MENY!$N$2:O25,MENY!$O$2:$O$18),IF(C16>0,IF(B16=\"Lør\",\"-\",\"Ordinær\"),\"-\")),\"Søndag\"))","v":"-"},null,0,0,null,0,"",null,null,"",null,1,"00:00:00",0,"00:00:00","00:00:00","00:00:00","00:00:00","00:00:00","00:00:00",0,0,0,0,0,"07:30:00","00:00:00",0,1]
["2019-01-09",{"$f":"IF(WEEKDAY(A18,2)=1,WEEKNUM(A17)*-1-MENY!$I$12,IF(WEEKDAY(A17,2)<7,LOOKUP(WEEKDAY(A17,2),MENY!$P$8:$P$14,MENY!$Q$8:$Q$14),\"\"))","v":"Ons"},null,null,null,null,"",0,{"$f":"IF(H17=11,\"Ordinær +\",IF(T17=1,IF(H17>0,LOOKUP(H17,MENY!$N$2:O26,MENY!$O$2:$O$18),IF(C17>0,IF(B17=\"Lør\",\"-\",\"Ordinær\"),\"-\")),\"Søndag\"))","v":"-"},null,0,0,null,0,"",null,null,"",null,1,"00:00:00",0,"00:00:00","00:00:00","00:00:00","00:00:00","00:00:00","00:00:00",0,0,0,0,0,"07:30:00","00:00:00",0,1]
["2019-01-10",{"$f":"IF(WEEKDAY(A19,2)=1,WEEKNUM(A18)*-1-MENY!$I$12,IF(WEEKDAY(A18,2)<7,LOOKUP(WEEKDAY(A18,2),MENY!$P$8:$P$14,MENY!$Q$8:$Q$14),\"\"))","v":"Tors"},null,null,null,null,"",0,{"$f":"IF(H18=11,\"Ordinær +\",IF(T18=1,IF(H18>0,LOOKUP(H18,MENY!$N$2:O27,MENY!$O$2:$O$18),IF(C18>0,IF(B18=\"Lør\",\"-\",\"Ordinær\"),\"-\")),\"Søndag\"))","v":"-"},null,0,0,null,0,"",null,null,"",null,1,"00:00:00",0,"00:00:00","00:00:00","00:00:00","00:00:00","00:00:00","00:00:00",0,0,0,0,0,"07:30:00","00:00:00",0,1]
["2019-01-11",{"$f":"IF(WEEKDAY(A20,2)=1,WEEKNUM(A19)*-1-MENY!$I$12,IF(WEEKDAY(A19,2)<7,LOOKUP(WEEKDAY(A19,2),MENY!$P$8:$P$14,MENY!$Q$8:$Q$14),\"\"))","v":"Fre"},null,null,null,null,"",0,{"$f":"IF(H19=11,\"Ordinær +\",IF(T19=1,IF(H19>0,LOOKUP(H19,MENY!$N$2:O28,MENY!$O$2:$O$18),IF(C19>0,IF(B19=\"Lør\",\"-\",\"Ordinær\"),\"-\")),\"Søndag\"))","v":"-"},null,0,0,null,0,"",null,null,"",null,1,"00:00:00",0,"00:00:00","00:00:00","00:00:00","00:00:00","00:00:00","00:00:00",0,0,0,0,0,"07:30:00","00:00:00",0,1]
["2019-01-12",{"$f":"IF(WEEKDAY(A21,2)=1,WEEKNUM(A20)*-1-MENY!$I$12,IF(WEEKDAY(A20,2)<7,LOOKUP(WEEKDAY(A20,2),MENY!$P$8:$P$14,MENY!$Q$8:$Q$14),\"\"))","v":"Lør"},null,null,null,null,"00:00:00",0,{"$f":"IF(H20=11,\"Ordinær +\",IF(T20=1,IF(H20>0,LOOKUP(H20,MENY!$N$2:O29,MENY!$O$2:$O$18),IF(C20>0,IF(B20=\"Lør\",\"-\",\"Ordinær\"),\"-\")),\"Søndag\"))","v":"-"},null,0,0,null,0,"",null,null,"",null,1,"","","00:00:00","","","","","",0,0,0,0,0,"07:30:00","00:00:00",0,1]
["2019-01-13",{"$f":"IF(WEEKDAY(A22,2)=1,WEEKNUM(A21)*-1-MENY!$I$12,IF(WEEKDAY(A21,2)<7,LOOKUP(WEEKDAY(A21,2),MENY!$P$8:$P$14,MENY!$Q$8:$Q$14),\"\"))","v":-3},null,null,null,null,"",0,{"$f":"IF(H21=11,\"Ordinær +\",IF(T21=1,IF(H21>0,LOOKUP(H21,MENY!$N$2:O30,MENY!$O$2:$O$18),IF(C21>0,IF(B21=\"Lør\",\"-\",\"Ordinær\"),\"-\")),\"Søndag\"))","v":"Søndag"},null,0,0,null,0,"",null,null,"",null,0,"00:00:00","","00:00:00","00:00:00","00:00:00","00:00:00","00:00:00","00:00:00",0,0,0,0,0,"07:30:00","00:00:00",0,1]
["2019-01-14",{"$f":"IF(WEEKDAY(A23,2)=1,WEEKNUM(A22)*-1-MENY!$I$12,IF(WEEKDAY(A22,2)<7,LOOKUP(WEEKDAY(A22,2),MENY!$P$8:$P$14,MENY!$Q$8:$Q$14),\"\"))","v":"Man"},null,null,null,null,"",0,{"$f":"IF(H22=11,\"Ordinær +\",IF(T22=1,IF(H22>0,LOOKUP(H22,MENY!$N$2:O31,MENY!$O$2:$O$18),IF(C22>0,IF(B22=\"Lør\",\"-\",\"Ordinær\"),\"-\")),\"Søndag\"))","v":"-"},null,0,0,null,0,"",null,null,"",null,1,"00:00:00",0,"00:00:00","00:00:00","00:00:00","00:00:00","00:00:00","00:00:00",0,0,0,0,0,"07:30:00","00:00:00",0,1]
["2019-01-15",{"$f":"IF(WEEKDAY(A24,2)=1,WEEKNUM(A23)*-1-MENY!$I$12,IF(WEEKDAY(A23,2)<7,LOOKUP(WEEKDAY(A23,2),MENY!$P$8:$P$14,MENY!$Q$8:$Q$14),\"\"))","v":"Tirs"},null,null,null,null,"",0,{"$f":"IF(H23=11,\"Ordinær +\",IF(T23=1,IF(H23>0,LOOKUP(H23,MENY!$N$2:O32,MENY!$O$2:$O$18),IF(C23>0,IF(B23=\"Lør\",\"-\",\"Ordinær\"),\"-\")),\"Søndag\"))","v":"-"},null,0,0,null,0,"",null,null,"",null,1,"00:00:00",0,"00:00:00","00:00:00","00:00:00","00:00:00","00:00:00","00:00:00",0,0,0,0,0,"07:30:00","00:00:00",0,1]
["2019-01-16",{"$f":"IF(WEEKDAY(A25,2)=1,WEEKNUM(A24)*-1-MENY!$I$12,IF(WEEKDAY(A24,2)<7,LOOKUP(WEEKDAY(A24,2),MENY!$P$8:$P$14,MENY!$Q$8:$Q$14),\"\"))","v":"Ons"},null,null,null,null,"",0,{"$f":"IF(H24=11,\"Ordinær +\",IF(T24=1,IF(H24>0,LOOKUP(H24,MENY!$N$2:O33,MENY!$O$2:$O$18),IF(C24>0,IF(B24=\"Lør\",\"-\",\"Ordinær\"),\"-\")),\"Søndag\"))","v":"-"},null,0,0,null,0,"",null,null,"",null,1,"00:00:00",0,"00:00:00","00:00:00","00:00:00","00:00:00","00:00:00","00:00:00",0,0,0,0,0,"07:30:00","00:00:00",0,1]
["2019-01-17",{"$f":"IF(WEEKDAY(A26,2)=1,WEEKNUM(A25)*-1-MENY!$I$12,IF(WEEKDAY(A25,2)<7,LOOKUP(WEEKDAY(A25,2),MENY!$P$8:$P$14,MENY!$Q$8:$Q$14),\"\"))","v":"Tors"},null,null,null,null,"",0,{"$f":"IF(H25=11,\"Ordinær +\",IF(T25=1,IF(H25>0,LOOKUP(H25,MENY!$N$2:O34,MENY!$O$2:$O$18),IF(C25>0,IF(B25=\"Lør\",\"-\",\"Ordinær\"),\"-\")),\"Søndag\"))","v":"-"},null,0,0,null,0,"",null,null,"",null,1,"00:00:00",0,"00:00:00","00:00:00","00:00:00","00:00:00","00:00:00","00:00:00",0,0,0,0,0,"07:30:00","00:00:00",0,1]
["2019-01-18",{"$f":"IF(WEEKDAY(A27,2)=1,WEEKNUM(A26)*-1-MENY!$I$12,IF(WEEKDAY(A26,2)<7,LOOKUP(WEEKDAY(A26,2),MENY!$P$8:$P$14,MENY!$Q$8:$Q$14),\"\"))","v":"Fre"},null,null,null,null,"",0,{"$f":"IF(H26=11,\"Ordinær +\",IF(T26=1,IF(H26>0,LOOKUP(H26,MENY!$N$2:O35,MENY!$O$2:$O$18),IF(C26>0,IF(B26=\"Lør\",\"-\",\"Ordinær\"),\"-\")),\"Søndag\"))","v":"-"},null,0,0,null,0,"",null,null,"",null,1,"00:00:00",0,"00:00:00","00:00:00","00:00:00","00:00:00","00:00:00","00:00:00",0,0,0,0,0,"07:30:00","00:00:00",0,1]
["2019-01-19",{"$f":"IF(WEEKDAY(A28,2)=1,WEEKNUM(A27)*-1-MENY!$I$12,IF(WEEKDAY(A27,2)<7,LOOKUP(WEEKDAY(A27,2),MENY!$P$8:$P$14,MENY!$Q$8:$Q$14),\"\"))","v":"Lør"},null,null,null,null,"00:00:00",0,{"$f":"IF(H27=11,\"Ordinær +\",IF(T27=1,IF(H27>0,LOOKUP(H27,MENY!$N$2:O36,MENY!$O$2:$O$18),IF(C27>0,IF(B27=\"Lør\",\"-\",\"Ordinær\"),\"-\")),\"Søndag\"))","v":"-"},null,0,0,null,0,"",null,null,"",null,1,"","","00:00:00","","","","","",0,0,0,0,0,"07:30:00","00:00:00",0,1]
["2019-01-20",{"$f":"IF(WEEKDAY(A29,2)=1,WEEKNUM(A28)*-1-MENY!$I$12,IF(WEEKDAY(A28,2)<7,LOOKUP(WEEKDAY(A28,2),MENY!$P$8:$P$14,MENY!$Q$8:$Q$14),\"\"))","v":-4},null,null,null,null,"",0,{"$f":"IF(H28=11,\"Ordinær +\",IF(T28=1,IF(H28>0,LOOKUP(H28,MENY!$N$2:O37,MENY!$O$2:$O$18),IF(C28>0,IF(B28=\"Lør\",\"-\",\"Ordinær\"),\"-\")),\"Søndag\"))","v":"Søndag"},null,0,0,null,0,"",null,null,"",null,0,"00:00:00","","00:00:00","00:00:00","00:00:00","00:00:00","00:00:00","00:00:00",0,0,0,0,0,"07:30:00","00:00:00",0,1]
["2019-01-21",{"$f":"IF(WEEKDAY(A30,2)=1,WEEKNUM(A29)*-1-MENY!$I$12,IF(WEEKDAY(A29,2)<7,LOOKUP(WEEKDAY(A29,2),MENY!$P$8:$P$14,MENY!$Q$8:$Q$14),\"\"))","v":"Man"},null,null,null,null,"",0,{"$f":"IF(H29=11,\"Ordinær +\",IF(T29=1,IF(H29>0,LOOKUP(H29,MENY!$N$2:O38,MENY!$O$2:$O$18),IF(C29>0,IF(B29=\"Lør\",\"-\",\"Ordinær\"),\"-\")),\"Søndag\"))","v":"-"},null,0,0,null,0,"",null,null,"",null,1,"00:00:00",0,"00:00:00","00:00:00","00:00:00","00:00:00","00:00:00","00:00:00",0,0,0,0,0,"07:30:00","00:00:00",0,1]
["2019-01-22",{"$f":"IF(WEEKDAY(A31,2)=1,WEEKNUM(A30)*-1-MENY!$I$12,IF(WEEKDAY(A30,2)<7,LOOKUP(WEEKDAY(A30,2),MENY!$P$8:$P$14,MENY!$Q$8:$Q$14),\"\"))","v":"Tirs"},null,null,null,null,"",0,{"$f":"IF(H30=11,\"Ordinær +\",IF(T30=1,IF(H30>0,LOOKUP(H30,MENY!$N$2:O39,MENY!$O$2:$O$18),IF(C30>0,IF(B30=\"Lør\",\"-\",\"Ordinær\"),\"-\")),\"Søndag\"))","v":"-"},null,0,0,null,0,"",null,null,"",null,1,"00:00:00",0,"00:00:00","00:00:00","00:00:00","00:00:00","00:00:00","00:00:00",0,0,0,0,0,"07:30:00","00:00:00",0,1]
["2019-01-23",{"$f":"IF(WEEKDAY(A32,2)=1,WEEKNUM(A31)*-1-MENY!$I$12,IF(WEEKDAY(A31,2)<7,LOOKUP(WEEKDAY(A31,2),MENY!$P$8:$P$14,MENY!$Q$8:$Q$14),\"\"))","v":"Ons"},null,null,null,null,"",0,{"$f":"IF(H31=11,\"Ordinær +\",IF(T31=1,IF(H31>0,LOOKUP(H31,MENY!$N$2:O40,MENY!$O$2:$O$18),IF(C31>0,IF(B31=\"Lør\",\"-\",\"Ordinær\"),\"-\")),\"Søndag\"))","v":"-"},null,0,0,null,0,"",null,null,"",null,1,"00:00:00",0,"00:00:00","00:00:00","00:00:00","00:00:00","00:00:00","00:00:00",0,0,0,0,0,"07:30:00","00:00:00",0,1]
["2019-01-24",{"$f":"IF(WEEKDAY(A33,2)=1,WEEKNUM(A32)*-1-MENY!$I$12,IF(WEEKDAY(A32,2)<7,LOOKUP(WEEKDAY(A32,2),MENY!$P$8:$P$14,MENY!$Q$8:$Q$14),\"\"))","v":"Tors"},null,null,null,null,"",0,{"$f":"IF(H32=11,\"Ordinær +\",IF(T32=1,IF(H32>0,LOOKUP(H32,MENY!$N$2:O41,MENY!$O$2:$O$18),IF(C32>0,IF(B32=\"Lør\",\"-\",\"Ordinær\"),\"-\")),\"Søndag\"))","v":"-"},null,0,0,null,0,"",null,null,"",null,1,"00:00:00",0,"00:00:00","00:00:00","00:00:00","00:00:00","00:00:00","00:00:00",0,0,0,0,0,"07:30:00","00:00:00",0,1]
["2019-01-25",{"$f":"IF(WEEKDAY(A34,2)=1,WEEKNUM(A33)*-1-MENY!$I$12,IF(WEEKDAY(A33,2)<7,LOOKUP(WEEKDAY(A33,2),MENY!$P$8:$P$14,MENY!$Q$8:$Q$14),\"\"))","v":"Fre"},null,null,null,null,"",0,{"$f":"IF(H33=11,\"Ordinær +\",IF(T33=1,IF(H33>0,LOOKUP(H33,MENY!$N$2:O42,MENY!$O$2:$O$18),IF(C33>0,IF(B33=\"Lør\",\"-\",\"Ordinær\"),\"-\")),\"Søndag\"))","v":"-"},null,0,0,null,0,"",null,null,"",null,1,"00:00:00",0,"00:00:00","00:00:00","00:00:00","00:00:00","00:00:00","00:00:00",0,0,0,0,0,"07:30:00","00:00:00",0,1]
["2019-01-26",{"$f":"IF(WEEKDAY(A35,2)=1,WEEKNUM(A34)*-1-MENY!$I$12,IF(WEEKDAY(A34,2)<7,LOOKUP(WEEKDAY(A34,2),MENY!$P$8:$P$14,MENY!$Q$8:$Q$14),\"\"))","v":"Lør"},null,null,null,null,"00:00:00",0,{"$f":"IF(H34=11,\"Ordinær +\",IF(T34=1,IF(H34>0,LOOKUP(H34,MENY!$N$2:O43,MENY!$O$2:$O$18),IF(C34>0,IF(B34=\"Lør\",\"-\",\"Ordinær\"),\"-\")),\"Søndag\"))","v":"-"},null,0,0,null,0,"",null,null,"",null,1,"","","00:00:00","","","","","",0,0,0,0,0,"07:30:00","00:00:00",0,1]
["2019-01-27",{"$f":"IF(WEEKDAY(A36,2)=1,WEEKNUM(A35)*-1-MENY!$I$12,IF(WEEKDAY(A35,2)<7,LOOKUP(WEEKDAY(A35,2),MENY!$P$8:$P$14,MENY!$Q$8:$Q$14),\"\"))","v":-5},null,null,null,null,"",0,{"$f":"IF(H35=11,\"Ordinær +\",IF(T35=1,IF(H35>0,LOOKUP(H35,MENY!$N$2:O44,MENY!$O$2:$O$18),IF(C35>0,IF(B35=\"Lør\",\"-\",\"Ordinær\"),\"-\")),\"Søndag\"))","v":"Søndag"},null,0,0,null,0,"",null,null,"",null,{"$f":"IF(A35>0,IF(WEEKDAY(A35-1)<7,1,0),\"\")","v":0},"00:00:00","","00:00:00","00:00:00","00:00:00","00:00:00","00:00:00","00:00:00",0,0,0,0,0,"07:30:00","00:00:00",0,1]
["2019-01-28",{"$f":"IF(WEEKDAY(A37,2)=1,WEEKNUM(A36)*-1-MENY!$I$12,IF(WEEKDAY(A36,2)<7,LOOKUP(WEEKDAY(A36,2),MENY!$P$8:$P$14,MENY!$Q$8:$Q$14),\"\"))","v":"Man"},null,null,null,null,"",0,{"$f":"IF(H36=11,\"Ordinær +\",IF(T36=1,IF(H36>0,LOOKUP(H36,MENY!$N$2:O45,MENY!$O$2:$O$18),IF(C36>0,IF(B36=\"Lør\",\"-\",\"Ordinær\"),\"-\")),\"Søndag\"))","v":"-"},null,0,0,null,0,"",null,null,"",null,{"$f":"IF(A36>0,IF(WEEKDAY(A36-1)<7,1,0),\"\")","v":1},"00:00:00",0,"00:00:00","00:00:00","00:00:00","00:00:00","00:00:00","00:00:00",0,0,0,0,0,"07:30:00","00:00:00",0,1]
["2019-01-29",{"$f":"IF(WEEKDAY(A38,2)=1,WEEKNUM(A37)*-1-MENY!$I$12,IF(WEEKDAY(A37,2)<7,LOOKUP(WEEKDAY(A37,2),MENY!$P$8:$P$14,MENY!$Q$8:$Q$14),\"\"))","v":"Tirs"},null,null,null,null,"",0,{"$f":"IF(H37=11,\"Ordinær +\",IF(T37=1,IF(H37>0,LOOKUP(H37,MENY!$N$2:O46,MENY!$O$2:$O$18),IF(C37>0,IF(B37=\"Lør\",\"-\",\"Ordinær\"),\"-\")),\"Søndag\"))","v":"-"},null,0,0,null,0,"",null,null,"",null,{"$f":"IF(A37>0,IF(WEEKDAY(A37-1)<7,1,0),\"\")","v":1},"00:00:00",0,"00:00:00","00:00:00","00:00:00","00:00:00","00:00:00","00:00:00",0,0,0,0,0,"07:30:00","00:00:00",0,1]
["2019-01-30",{"$f":"IF(WEEKDAY(A39,2)=1,WEEKNUM(A38)*-1-MENY!$I$12,IF(WEEKDAY(A38,2)<7,LOOKUP(WEEKDAY(A38,2),MENY!$P$8:$P$14,MENY!$Q$8:$Q$14),\"\"))","v":"Ons"},null,null,null,null,"",0,{"$f":"IF(H38=11,\"Ordinær +\",IF(T38=1,IF(H38>0,LOOKUP(H38,MENY!$N$2:O47,MENY!$O$2:$O$18),IF(C38>0,IF(B38=\"Lør\",\"-\",\"Ordinær\"),\"-\")),\"Søndag\"))","v":"-"},null,0,0,null,0,"",null,null,"",null,{"$f":"IF(A38>0,IF(WEEKDAY(A38-1)<7,1,0),\"\")","v":1},"00:00:00",0,"00:00:00","00:00:00","00:00:00","00:00:00","00:00:00","00:00:00",0,0,0,0,0,"07:30:00","00:00:00",0,1]
["2019-01-31",{"$f":"IF(WEEKDAY(A40,2)=1,WEEKNUM(A39)*-1-MENY!$I$12,IF(WEEKDAY(A39,2)<7,LOOKUP(WEEKDAY(A39,2),MENY!$P$8:$P$14,MENY!$Q$8:$Q$14),\"\"))","v":"Tors"},null,null,null,null,"",0,{"$f":"IF(H39=11,\"Ordinær +\",IF(T39=1,IF(H39>0,LOOKUP(H39,MENY!$N$2:O48,MENY!$O$2:$O$18),IF(C39>0,IF(B39=\"Lør\",\"-\",\"Ordinær\"),\"-\")),\"Søndag\"))","v":"-"},null,0,0,null,0,"",null,null,"",null,{"$f":"IF(A39>0,IF(WEEKDAY(A39-1)<7,1,0),\"\")","v":1},"00:00:00",0,"00:00:00","00:00:00","00:00:00","00:00:00",{"$f":"IF(B39=\"Lør\",\"\",IF(T39=1,IF(H39=9,AH39,0),0))","v":"00:00:00"},"00:00:00",0,0,0,0,0,"07:30:00","00:00:00",0,1]
[null,null,null,"Sum for denne måned",null,null,{"$f":"SUM(G9:G39)*24","v":0},null,null,null,{"$f":"SUM(K9:K39)+N49","v":0},{"$f":"SUM(L9:L39)","v":0},{"$f":"SUM(M9:M39)","v":0},{"$f":"SUM(N9:N39)-U40-AG41-SUM(K40:M40)+N50","v":0},{"$f":"SUM(O9:O39)","v":0},"Fravær denne måned",null,null,null,null,{"$f":"SUM(U9:U39)*24","v":0},{"$f":"SUM(V9:V39)","v":0},{"$f":"SUM(W9:W39)*24","v":0},0,0,0,0,0,{"$f":"SUM(AC9:AC39)","v":0},{"$f":"SUM(AD9:AD39)","v":0},{"$f":"SUM(AE9:AE39)","v":0},{"$f":"SUM(AF9:AF39)","v":0},{"$f":"SUM(AG9:AG39)","v":0}]
[null,null,null,"Overført fra forrige år",null,null,null,null,null,null,null,null,null,{"$f":"MENY!F16","v":0},null,"Type","Timer",null,null,null,null,null,null,null,null,null,null,null,null,null,null,"Sum deltidsfravær:",{"$f":"SUM(AC40:AG40)","v":0}]
[null,null,null,"Sum hittil i år",null,null,null,null,null,null,null,null,null,{"$f":"SUM(N40:N41)","v":0},null,"06 Perm m/lønn",{"$f":"X40+AC40*-1","v":0}]
["Ferieregnskap",null,null,"Dager","Timeregnskap",null,null,null,null,null,null,null,null,"Timer",null,"07 Perm u/lønn",{"$f":"Y40+AD40*-1","v":0}]
["Disponible feriedager",null,null,{"$f":"MENY!F20","v":25},"Opptjent denne måneden",null,null,null,null,null,null,null,null,{"$f":"SUM(N9:N39)-AG41-(SUM(K40:M40))+N50","v":0},null,"08 Sykemelding",{"$f":"(Z40+AE40*-1)","v":0}]
["Brukt denne måned",null,null,{"$f":"V40*-1","v":0},"Avspasert denne måneden",null,null,null,null,null,null,null,null,{"$f":"U40","v":0},null,"09 Egenmelding",{"$f":"(AA40+AF40*-1)","v":0}]
["Endring i feriedager",null,null,null,"Utbetalt overtid denne måned",null,null,null,null,null,null,null,null,{"$f":"SUM(K40:M40)","v":0},null,"10 Sykt barn",{"$f":"(AB40+AG40*-1)","v":0}]
["Til gode",null,null,{"$f":"SUM(D44:D46)","v":25},"Til gode for avspasering",null,null,null,null,null,null,null,null,{"$f":"N42","v":0},null,"Sum - Januar",{"$f":"SUM(Q42:Q46)","v":0}]
[null,null,null,null,"Effektiv arbeidstid denne måned",null,null,null,null,null,null,null,null,{"$f":"G40+N44+AG41+N46-N50","v":0},null,"Hittil i år",{"$f":"Q47","v":0}]
[null,null,null,null,"Flexitid omgjort til overtid og utbetalt, denne måned"]
[null,null,null,null,"Annen korrigering av flexitid, OBS! skriv egen merknad"]
["Merknader"]
[]
[]
[]
[]
[]
["Overtid for utbetaling:",null,null,null,null,null,"Dato",null,null,null,null,null,null,null,"Dato"]
[null,null,null,"Timer med 50% tillegg :",{"$f":"K40","v":0}]
[null,null,null,"Timer med 100% tillegg:",{"$f":"L40","v":0}]
[null,null,null,"Timer med 133% tillegg:",{"$f":"M39","v":0},null,null,null,"Attestert",null,null,null,null,null,"Anvist"]
[]
[]
[null,null,null,null,null,null,null,null,null,null,null,null,null,null,null,{"$f":"MENY!D6","v":"Leder"}]
["© Ole Jørgen Klaussen - 2003",null,null,null,{"$f":"TODAY()","v":"2018-11-30"},{"$f":"YEAR(TODAY())","v":2018},null,null,null,null,null,null,null,null,null,null,"ole.klaussen@online.no"]

{"sheet":"FEB","index":2,"n_rows":64,"n_cols":37,"rows_kept":64,"cut":false,"hidden":false,"merged":[[5,19,5,22],[23,15,23,16],[24,15,24,16],[25,15,25,16],[6,3,6,4],[7,7,7,8],[22,15,22,16],[21,15,21,16],[35,15,35,16],[26,15,26,16],[30,15,30,16],[31,15,31,16],[32,15,32,16],[33,15,33,16],[27,15,27,16],[34,15,34,16],[28,15,28,16],[29,15,29,16],[14,15,14,16],[15,15,15,16],[19,15,19,16],[20,15,20,16],[2,1,2,6],[16,15,16,16],[17,15,17,16],[18,15,18,16],[12,15,12,16],[10,15,10,16],[11,15,11,16],[5,7,6,16],[7,15,7,16],[2,15,2,16],[1,28,2,33],[59,14,59,16],[62,6,62,10],[55,0,55,16],[56,6,56,10],[56,14,56,16],[51,0,51,16],[52,0,52,16],[53,0,53,16],[54,0,54,16],[36,15,36,16],[37,15,37,16],[38,15,38,16],[8,15,8,16],[9,15,9,16],[13,15,13,16]]}
["Meny","JAN","FEB","MAR","APR","MAI","JUN",null,null,null,null,null,null,null,null,null,"Hjelp","Viktig når det gjelder overtid"]
["Året","JUL","AUG","SEP","OKT","NOV","DES",null,null,null,null,null,null,null,null,"Dato",null,"For at føringer av aktiv arbeidstid skal bli riktig er det"]
[null,{"$f":"MENY!D4","v":"Min bedrift"},null,null,null,null,null,null,"Februar - ",null,null,null,null,{"$f":"MENY!P1","v":2019},null,{"$f":"TODAY()","v":"2018-11-30"},null,"nødvendig at all arbeidstid registreres. Dette gjelder  også"]
[null,"Timeliste","Navn:",{"$f":"MENY!D5","v":"Min timeliste"},null,null,"Sommer",null,null,null,"Stillingsbrøk:",{"$f":"MENY!I5","v":1},null,"Vinter",null,null,null,"overtid. Registrer  når du kommer (inn) og når du går (ut)",null,null,null,null,null,null,null,null,null,null,null,null,null,null,null,null,null,"MERK!"]
[null,null,"Sommerlukking fra/til:",null,{"$f":"MENY!Q18","v":"2019-05-15"},{"$f":"MENY!Q19","v":"2019-09-14"},{"$f":"(MENY!F13-MENY!E13-MENY!I13)*MENY!I5","v":"07:30:00"},null,{"$f":"MENY!I13","v":"00:00:00"},"  <-arbeidstid->",null,null,{"$f":"MENY!I14","v":"00:00:00"},{"$f":"(MENY!F14-MENY!E14-MENY!I14)*MENY!I5","v":"07:30:00"},null,null,null,"Dersom noe av tiden skal utbetales i overtid, bruk kode 12",null,null,null,null,null,null,null,null,null,null,null,null,null,null,null,null,null,"Les her"]
["År ",null,null,null,null,null,null,"Fyll ut i arbeids og fraværskode : 0=ordinær  1=Avspasere  2=Ferie  3=Tjeneste  4=Plussdag  5=Helligdag  6=Perm M/lønn  7=Perm U/lønn  8=Sykemelding  9=Egenmelding 10=Sykt barn 11=Ordinær+ , 12 = plusstid som overtid",null,null,null,null,null,null,null,null,null,"for arbeidskode.   Fordeling mellom 50% og 100% skjer",null,"Arbeidsdata",null,null,null,null,null,null,null,null,6,7,8,9,10,null,null,"Syke-","Stillings"]
[{"$f":"N3","v":2019},{"$f":"WEEKNUM(A9)+MENY!I12","v":5},"I dag","Fravær pr dag",null,"I dag",null,null,null,null,null,null,null,null,null,null,null,"automatisk, men kan  også endres.",null,null,null,null,null,6,7,8,9,10,12,13,14,15,16,null,null,"melding","brøk"]
["DATO","UKENR                               og DAG","Inn","Ut","Inn","Ut","Ordinær","Arbeids og fraværskode",null,"Fravær",0.5,1,1.33,"Balanse","Timer i dag","Merknad ",null,"Huskeliste",null,"Arbeids dag","Avsp","Ferie","Tjeneste","Perm m-lønn","Perm u-lønn","Sykemelding","Egenmelding","Sykt barn","Perm m-lønn","Perm u-lønn","Sykemelding","Egenmelding","Sykt barn","Ordinær arbeidstid","Trekk for matpause","i prosent andel"]
[{"$f":"DATE(MENY!P1,2,1)","v":"2019-02-01"},{"$f":"IF(WEEKDAY(A10,2)=1,WEEKNUM(A9)*-1-MENY!$I$12,IF(WEEKDAY(A9,2)<7,LOOKUP(WEEKDAY(A9,2),MENY!$P$8:$P$14,MENY!$Q$8:$Q$14),\"\"))","v":"Fre"},null,null,null,null,{"$f":"IF(H9=11,F9-C9-(E9-D9),IF(B9=\"Lør\",0,IF(H9=4,0,IF(H9=3,IF(T9>0,W9,\"\"),IF(H9=1,0, IF(C9>0,  AH9,       \"\"))))))","v":""},{"$f":"IF(B9=\"Lør\",IF(C9>0,4,0),0)","v":0},{"$f":"IF(H9=11,\"Ordinær +\",IF(T9=1,IF(H9>0,LOOKUP(H9,MENY!$N$2:O18,MENY!$O$2:$O$18),IF(C9>0,IF(B9=\"Lør\",\"-\",\"Ordinær\"),\"-\")),\"Søndag\"))","v":"-"},null,{"$f":"IF(H9=12,IF(N9>=4,4,N9),0)","v":0},{"$f":"IF(H9=12,IF(N9>K9,N9-4,0),0)","v":0},null,{"$f":"IF(H9=11,0,IF(T9=1,IF(H9=4,((F9-C9)-(E9-D9))*24,IF(C9>0,(F9-C9-(E9-D9)-G9-AI9)*24,0)),0))","v":0},{"$f":"IF(F9>0,G9*24+N9,\"\")","v":""},null,null,{"$f":"IF(O9=\"\",\"\",\"Husk, fordel timer til prosjekter\")","v":""},null,{"$f":"IF(WEEKDAY(A9-1)<7,1,0)","v":1},{"$f":"IF(B9=\"Lør\",\"\",IF(T9=1,IF(H9=1,AH9,0),0))","v":"00:00:00"},{"$f":"IF(T9=1,IF(B9=\"lør\",\"\",IF(H9=2,1,0)),\"\")","v":0},{"$f":"IF(T9=1,IF(H9=3,AH9,0),0)","v":"00:00:00"},{"$f":"IF(B9=\"lør\",\"\",IF(T9=1,IF(H9=6,AH9,0),0))","v":"00:00:00"},{"$f":"IF(B9=\"Lør\",\"\",IF(T9=1,IF(H9=7,AH9,0),0))","v":"00:00:00"},{"$f":"IF(AJ9>0,IF(C9>0,    (AH9*AJ9)/(1-AJ9),0),           IF(B9=\"Lør\",\"\",IF(T9=1,IF(H9=8,AH9,0),0)))","v":"00:00:00"},{"$f":"IF(B9=\"Lør\",\"\",IF(T9=1,IF(H9=9,AH9,0),0))","v":"00:00:00"},{"$f":"IF(B9=\"Lør\",\"\",IF(T9=1,IF(H9=10,AH9,0),0))","v":"00:00:00"},{"$f":"IF(J9=6,N9,0)","v":0},{"$f":"IF(J9=7,N9,0)","v":0},{"$f":"IF(J9=8,N9,0)","v":0},{"$f":"IF(J9=9,N9,0)","v":0},{"$f":"IF(J9=10,N9,0)","v":0},{"$f":"((IF(A9<$F$5+1,IF(A9>$E$5-1,$G$5,$N$5),$N$5))*(1-AJ9))*(AK9)","v":"07:30:00"},{"$f":"IF(A9<$F$5+1,IF(A9>$E$5-1,$I$5,$M$5),$M$5)","v":"00:00:00"},{"$f":"JAN!AJ39","v":0},{"$f":"JAN!AK39","v":1}]
[{"$f":"A9+1","v":"2019-02-02"},{"$f":"IF(WEEKDAY(A11,2)=1,WEEKNUM(A10)*-1-MENY!$I$12,IF(WEEKDAY(A10,2)<7,LOOKUP(WEEKDAY(A10,2),MENY!$P$8:$P$14,MENY!$Q$8:$Q$14),\"\"))","v":"Lør"},null,null,null,null,{"$f":"IF(H10=11,F10-C10-(E10-D10),IF(B10=\"Lør\",0,IF(H10=4,0,IF(H10=3,IF(T10>0,W10,\"\"),IF(H10=1,0, IF(C10>0,  AH10,       \"\"))))))","v":"00:00:00"},0,{"$f":"IF(H10=11,\"Ordinær +\",IF(T10=1,IF(H10>0,LOOKUP(H10,MENY!$N$2:O19,MENY!$O$2:$O$18),IF(C10>0,IF(B10=\"Lør\",\"-\",\"Ordinær\"),\"-\")),\"Søndag\"))","v":"-"},null,{"$f":"IF(H10=12,IF(N10>=4,4,N10),0)","v":0},{"$f":"IF(H10=12,IF(N10>K10,N10-4,0),0)","v":0},null,{"$f":"IF(H10=11,0,IF(T10=1,IF(H10=4,((F10-C10)-(E10-D10))*24,IF(C10>0,(F10-C10-(E10-D10)-G10-AI10)*24,0)),0))","v":0},{"$f":"IF(F10>0,G10*24+N10,\"\")","v":""},null,null,{"$f":"IF(O10=\"\",\"\",\"Husk, fordel timer til prosjekter\")","v":""},null,{"$f":"IF(WEEKDAY(A10-1)<7,1,0)","v":1},{"$f":"IF(B10=\"Lør\",\"\",IF(T10=1,IF(H10=1,AH10,0),0))","v":""},"",{"$f":"IF(T10=1,IF(H10=3,AH10,0),0)","v":"00:00:00"},{"$f":"IF(B10=\"lør\",\"\",IF(T10=1,IF(H10=6,AH10,0),0))","v":""},{"$f":"IF(B10=\"Lør\",\"\",IF(T10=1,IF(H10=7,AH10,0),0))","v":""},{"$f":"IF(AJ10>0,IF(C10>0,    (AH10*AJ10)/(1-AJ10),0),           IF(B10=\"Lør\",\"\",IF(T10=1,IF(H10=8,AH10,0),0)))","v":""},{"$f":"IF(B10=\"Lør\",\"\",IF(T10=1,IF(H10=9,AH10,0),0))","v":""},{"$f":"IF(B10=\"Lør\",\"\",IF(T10=1,IF(H10=10,AH10,0),0))","v":""},0,0,0,0,0,{"$f":"((IF(A10<$F$5+1,IF(A10>$E$5-1,$G$5,$N$5),$N$5))*(1-AJ10))*(AK10)","v":"07:30:00"},{"$f":"IF(A10<$F$5+1,IF(A10>$E$5-1,$I$5,$M$5),$M$5)","v":"00:00:00"},{"$f":"AJ9","v":0},{"$f":"AK9","v":1}]
[{"$f":"A10+1","v":"2019-02-03"},{"$f":"IF(WEEKDAY(A12,2)=1,WEEKNUM(A11)*-1-MENY!$I$12,IF(WEEKDAY(A11,2)<7,LOOKUP(WEEKDAY(A11,2),MENY!$P$8:$P$14,MENY!$Q$8:$Q$14),\"\"))","v":-6},null,null,null,null,{"$f":"IF(H11=11,F11-C11-(E11-D11),IF(B11=\"Lør\",0,IF(H11=4,0,IF(H11=3,IF(T11>0,W11,\"\"),IF(H11=1,0, IF(C11>0,  AH11,       \"\"))))))","v":""},0,{"$f":"IF(H11=11,\"Ordinær +\",IF(T11=1,IF(H11>0,LOOKUP(H11,MENY!$N$2:O20,MENY!$O$2:$O$18),IF(C11>0,IF(B11=\"Lør\",\"-\",\"Ordinær\"),\"-\")),\"Søndag\"))","v":"Søndag"},null,0,0,null,0,"",null,null,"",null,0,"00:00:00","","00:00:00","00:00:00","00:00:00","00:00:00","00:00:00","00:00:00",0,0,0,0,0,"07:30:00","00:00:00",{"$f":"AJ10","v":0},{"$f":"AK10","v":1}]
["2019-02-04",{"$f":"IF(WEEKDAY(A13,2)=1,WEEKNUM(A12)*-1-MENY!$I$12,IF(WEEKDAY(A12,2)<7,LOOKUP(WEEKDAY(A12,2),MENY!$P$8:$P$14,MENY!$Q$8:$Q$14),\"\"))","v":"Man"},null,null,null,null,"",0,{"$f":"IF(H12=11,\"Ordinær +\",IF(T12=1,IF(H12>0,LOOKUP(H12,MENY!$N$2:O21,MENY!$O$2:$O$18),IF(C12>0,IF(B12=\"Lør\",\"-\",\"Ordinær\"),\"-\")),\"Søndag\"))","v":"-"},null,0,0,null,0,"",null,null,"",null,1,"00:00:00",0,"00:00:00","00:00:00","00:00:00","00:00:00","00:00:00","00:00:00",0,0,0,0,0,"07:30:00","00:00:00",0,1]
["2019-02-05",{"$f":"IF(WEEKDAY(A14,2)=1,WEEKNUM(A13)*-1-MENY!$I$12,IF(WEEKDAY(A13,2)<7,LOOKUP(WEEKDAY(A13,2),MENY!$P$8:$P$14,MENY!$Q$8:$Q$14),\"\"))","v":"Tirs"},null,null,null,null,"",0,{"$f":"IF(H13=11,\"Ordinær +\",IF(T13=1,IF(H13>0,LOOKUP(H13,MENY!$N$2:O22,MENY!$O$2:$O$18),IF(C13>0,IF(B13=\"Lør\",\"-\",\"Ordinær\"),\"-\")),\"Søndag\"))","v":"-"},null,0,0,null,0,"",null,null,"",null,1,"00:00:00",0,"00:00:00","00:00:00","00:00:00","00:00:00","00:00:00","00:00:00",0,0,0,0,0,"07:30:00","00:00:00",0,1]
["2019-02-06",{"$f":"IF(WEEKDAY(A15,2)=1,WEEKNUM(A14)*-1-MENY!$I$12,IF(WEEKDAY(A14,2)<7,LOOKUP(WEEKDAY(A14,2),MENY!$P$8:$P$14,MENY!$Q$8:$Q$14),\"\"))","v":"Ons"},null,null,null,null,"",0,{"$f":"IF(H14=11,\"Ordinær +\",IF(T14=1,IF(H14>0,LOOKUP(H14,MENY!$N$2:O23,MENY!$O$2:$O$18),IF(C14>0,IF(B14=\"Lør\",\"-\",\"Ordinær\"),\"-\")),\"Søndag\"))","v":"-"},null,0,0,null,0,"",null,null,"",null,1,"00:00:00",0,"00:00:00","00:00:00","00:00:00","00:00:00","00:00:00","00:00:00",0,0,0,0,0,"07:30:00","00:00:00",0,1]
["2019-02-07",{"$f":"IF(WEEKDAY(A16,2)=1,WEEKNUM(A15)*-1-MENY!$I$12,IF(WEEKDAY(A15,2)<7,LOOKUP(WEEKDAY(A15,2),MENY!$P$8:$P$14,MENY!$Q$8:$Q$14),\"\"))","v":"Tors"},null,null,null,null,"",0,{"$f":"IF(H15=11,\"Ordinær +\",IF(T15=1,IF(H15>0,LOOKUP(H15,MENY!$N$2:O24,MENY!$O$2:$O$18),IF(C15>0,IF(B15=\"Lør\",\"-\",\"Ordinær\"),\"-\")),\"Søndag\"))","v":"-"},null,0,0,null,0,"",null,null,"",null,1,"00:00:00",0,"00:00:00","00:00:00","00:00:00","00:00:00","00:00:00","00:00:00",0,0,0,0,0,"07:30:00","00:00:00",0,1]
["2019-02-08",{"$f":"IF(WEEKDAY(A17,2)=1,WEEKNUM(A16)*-1-MENY!$I$12,IF(WEEKDAY(A16,2)<7,LOOKUP(WEEKDAY(A16,2),MENY!$P$8:$P$14,MENY!$Q$8:$Q$14),\"\"))","v":"Fre"},null,null,null,null,"",0,{"$f":"IF(H16=11,\"Ordinær +\",IF(T16=1,IF(H16>0,LOOKUP(H16,MENY!$N$2:O25,MENY!$O$2:$O$18),IF(C16>0,IF(B16=\"Lør\",\"-\",\"Ordinær\"),\"-\")),\"Søndag\"))","v":"-"},null,0,0,null,0,"",null,null,"",null,1,"00:00:00",0,"00:00:00","00:00:00","00:00:00","00:00:00","00:00:00","00:00:00",0,0,0,0,0,"07:30:00","00:00:00",0,1]
["2019-02-09",{"$f":"IF(WEEKDAY(A18,2)=1,WEEKNUM(A17)*-1-MENY!$I$12,IF(WEEKDAY(A17,2)<7,LOOKUP(WEEKDAY(A17,2),MENY!$P$8:$P$14,MENY!$Q$8:$Q$14),\"\"))","v":"Lør"},null,null,null,null,"00:00:00",0,{"$f":"IF(H17=11,\"Ordinær +\",IF(T17=1,IF(H17>0,LOOKUP(H17,MENY!$N$2:O26,MENY!$O$2:$O$18),IF(C17>0,IF(B17=\"Lør\",\"-\",\"Ordinær\"),\"-\")),\"Søndag\"))","v":"-"},null,0,0,null,0,"",null,null,"",null,1,"","","00:00:00","","","","","",0,0,0,0,0,"07:30:00","00:00:00",0,1]
["2019-02-10",{"$f":"IF(WEEKDAY(A19,2)=1,WEEKNUM(A18)*-1-MENY!$I$12,IF(WEEKDAY(A18,2)<7,LOOKUP(WEEKDAY(A18,2),MENY!$P$8:$P$14,MENY!$Q$8:$Q$14),\"\"))","v":-7},null,null,null,null,"",0,{"$f":"IF(H18=11,\"Ordinær +\",IF(T18=1,IF(H18>0,LOOKUP(H18,MENY!$N$2:O27,MENY!$O$2:$O$18),IF(C18>0,IF(B18=\"Lør\",\"-\",\"Ordinær\"),\"-\")),\"Søndag\"))","v":"Søndag"},null,0,0,null,0,"",null,null,"",null,0,"00:00:00","","00:00:00","00:00:00","00:00:00","00:00:00","00:00:00","00:00:00",0,0,0,0,0,"07:30:00","00:00:00",0,1]
["2019-02-11",{"$f":"IF(WEEKDAY(A20,2)=1,WEEKNUM(A19)*-1-MENY!$I$12,IF(WEEKDAY(A19,2)<7,LOOKUP(WEEKDAY(A19,2),MENY!$P$8:$P$14,MENY!$Q$8:$Q$14),\"\"))","v":"Man"},null,null,null,null,"",0,{"$f":"IF(H19=11,\"Ordinær +\",IF(T19=1,IF(H19>0,LOOKUP(H19,MENY!$N$2:O28,MENY!$O$2:$O$18),IF(C19>0,IF(B19=\"Lør\",\"-\",\"Ordinær\"),\"-\")),\"Søndag\"))","v":"-"},null,0,0,null,0,"",null,null,"",null,1,"00:00:00",0,"00:00:00","00:00:00","00:00:00","00:00:00","00:00:00","00:00:00",0,0,0,0,0,"07:30:00","00:00:00",0,1]
["2019-02-12",{"$f":"IF(WEEKDAY(A21,2)=1,WEEKNUM(A20)*-1-MENY!$I$12,IF(WEEKDAY(A20,2)<7,LOOKUP(WEEKDAY(A20,2),MENY!$P$8:$P$14,MENY!$Q$8:$Q$14),\"\"))","v":"Tirs"},null,null,null,null,"",0,{"$f":"IF(H20=11,\"Ordinær +\",IF(T20=1,IF(H20>0,LOOKUP(H20,MENY!$N$2:O29,MENY!$O$2:$O$18),IF(C20>0,IF(B20=\"Lør\",\"-\",\"Ordinær\"),\"-\")),\"Søndag\"))","v":"-"},null,0,0,null,0,"",null,null,"",null,1,"00:00:00",0,"00:00:00","00:00:00","00:00:00","00:00:00","00:00:00","00:00:00",0,0,0,0,0,"07:30:00","00:00:00",0,1]
["2019-02-13",{"$f":"IF(WEEKDAY(A22,2)=1,WEEKNUM(A21)*-1-MENY!$I$12,IF(WEEKDAY(A21,2)<7,LOOKUP(WEEKDAY(A21,2),MENY!$P$8:$P$14,MENY!$Q$8:$Q$14),\"\"))","v":"Ons"},null,null,null,null,"",0,{"$f":"IF(H21=11,\"Ordinær +\",IF(T21=1,IF(H21>0,LOOKUP(H21,MENY!$N$2:O30,MENY!$O$2:$O$18),IF(C21>0,IF(B21=\"Lør\",\"-\",\"Ordinær\"),\"-\")),\"Søndag\"))","v":"-"},null,0,0,null,0,"",null,null,"",null,1,"00:00:00",0,"00:00:00","00:00:00","00:00:00","00:00:00","00:00:00","00:00:00",0,0,0,0,0,"07:30:00","00:00:00",0,1]
["2019-02-14",{"$f":"IF(WEEKDAY(A23,2)=1,WEEKNUM(A22)*-1-MENY!$I$12,IF(WEEKDAY(A22,2)<7,LOOKUP(WEEKDAY(A22,2),MENY!$P$8:$P$14,MENY!$Q$8:$Q$14),\"\"))","v":"Tors"},null,null,null,null,"",0,{"$f":"IF(H22=11,\"Ordinær +\",IF(T22=1,IF(H22>0,LOOKUP(H22,MENY!$N$2:O31,MENY!$O$2:$O$18),IF(C22>0,IF(B22=\"Lør\",\"-\",\"Ordinær\"),\"-\")),\"Søndag\"))","v":"-"},null,0,0,null,0,"",null,null,"",null,1,"00:00:00",0,"00:00:00","00:00:00","00:00:00","00:00:00","00:00:00","00:00:00",0,0,0,0,0,"07:30:00","00:00:00",0,1]
["2019-02-15",{"$f":"IF(WEEKDAY(A24,2)=1,WEEKNUM(A23)*-1-MENY!$I$12,IF(WEEKDAY(A23,2)<7,LOOKUP(WEEKDAY(A23,2),MENY!$P$8:$P$14,MENY!$Q$8:$Q$14),\"\"))","v":"Fre"},null,null,null,null,"",0,{"$f":"IF(H23=11,\"Ordinær +\",IF(T23=1,IF(H23>0,LOOKUP(H23,MENY!$N$2:O32,MENY!$O$2:$O$18),IF(C23>0,IF(B23=\"Lør\",\"-\",\"Ordinær\"),\"-\")),\"Søndag\"))","v":"-"},null,0,0,null,0,"",null,null,"",null,1,"00:00:00",0,"00:00:00","00:00:00","00:00:00","00:00:00","00:00:00","00:00:00",0,0,0,0,0,"07:30:00","00:00:00",0,1]
["2019-02-16",{"$f":"IF(WEEKDAY(A25,2)=1,WEEKNUM(A24)*-1-MENY!$I$12,IF(WEEKDAY(A24,2)<7,LOOKUP(WEEKDAY(A24,2),MENY!$P$8:$P$14,MENY!$Q$8:$Q$14),\"\"))","v":"Lør"},null,null,null,null,"00:00:00",0,{"$f":"IF(H24=11,\"Ordinær +\",IF(T24=1,IF(H24>0,LOOKUP(H24,MENY!$N$2:O33,MENY!$O$2:$O$18),IF(C24>0,IF(B24=\"Lør\",\"-\",\"Ordinær\"),\"-\")),\"Søndag\"))","v":"-"},null,0,0,null,0,"",null,null,"",null,1,"","","00:00:00","","","","","",0,0,0,0,0,"07:30:00","00:00:00",0,1]
["2019-02-17",{"$f":"IF(WEEKDAY(A26,2)=1,WEEKNUM(A25)*-1-MENY!$I$12,IF(WEEKDAY(A25,2)<7,LOOKUP(WEEKDAY(A25,2),MENY!$P$8:$P$14,MENY!$Q$8:$Q$14),\"\"))","v":-8},null,null,null,null,"",0,{"$f":"IF(H25=11,\"Ordinær +\",IF(T25=1,IF(H25>0,LOOKUP(H25,MENY!$N$2:O34,MENY!$O$2:$O$18),IF(C25>0,IF(B25=\"Lør\",\"-\",\"Ordinær\"),\"-\")),\"Søndag\"))","v":"Søndag"},null,0,0,null,0,"",null,null,"",null,0,"00:00:00","","00:00:00","00:00:00","00:00:00","00:00:00","00:00:00","00:00:00",0,0,0,0,0,"07:30:00","00:00:00",0,1]
["2019-02-18",{"$f":"IF(WEEKDAY(A27,2)=1,WEEKNUM(A26)*-1-MENY!$I$12,IF(WEEKDAY(A26,2)<7,LOOKUP(WEEKDAY(A26,2),MENY!$P$8:$P$14,MENY!$Q$8:$Q$14),\"\"))","v":"Man"},null,null,null,null,"",0,{"$f":"IF(H26=11,\"Ordinær +\",IF(T26=1,IF(H26>0,LOOKUP(H26,MENY!$N$2:O35,MENY!$O$2:$O$18),IF(C26>0,IF(B26=\"Lør\",\"-\",\"Ordinær\"),\"-\")),\"Søndag\"))","v":"-"},null,0,0,null,0,"",null,null,"",null,1,"00:00:00",0,"00:00:00","00:00:00","00:00:00","00:00:00","00:00:00","00:00:00",0,0,0,0,0,"07:30:00","00:00:00",0,1]
["2019-02-19",{"$f":"IF(WEEKDAY(A28,2)=1,WEEKNUM(A27)*-1-MENY!$I$12,IF(WEEKDAY(A27,2)<7,LOOKUP(WEEKDAY(A27,2),MENY!$P$8:$P$14,MENY!$Q$8:$Q$14),\"\"))","v":"Tirs"},null,null,null,null,"",0,{"$f":"IF(H27=11,\"Ordinær +\",IF(T27=1,IF(H27>0,LOOKUP(H27,MENY!$N$2:O36,MENY!$O$2:$O$18),IF(C27>0,IF(B27=\"Lør\",\"-\",\"Ordinær\"),\"-\")),\"Søndag\"))","v":"-"},null,0,0,null,0,"",null,null,"",null,1,"00:00:00",0,"00:00:00","00:00:00","00:00:00","00:00:00","00:00:00","00:00:00",0,0,0,0,0,"07:30:00","00:00:00",0,1]
["2019-02-20",{"$f":"IF(WEEKDAY(A29,2)=1,WEEKNUM(A28)*-1-MENY!$I$12,IF(WEEKDAY(A28,2)<7,LOOKUP(WEEKDAY(A28,2),MENY!$P$8:$P$14,MENY!$Q$8:$Q$14),\"\"))","v":"Ons"},null,null,null,null,"",0,{"$f":"IF(H28=11,\"Ordinær +\",IF(T28=1,IF(H28>0,LOOKUP(H28,MENY!$N$2:O37,MENY!$O$2:$O$18),IF(C28>0,IF(B28=\"Lør\",\"-\",\"Ordinær\"),\"-\")),\"Søndag\"))","v":"-"},null,0,0,null,0,"",null,null,"",null,1,"00:00:00",0,"00:00:00","00:00:00","00:00:00","00:00:00","00:00:00","00:00:00",0,0,0,0,0,"07:30:00","00:00:00",0,1]
["2019-02-21",{"$f":"IF(WEEKDAY(A30,2)=1,WEEKNUM(A29)*-1-MENY!$I$12,IF(WEEKDAY(A29,2)<7,LOOKUP(WEEKDAY(A29,2),MENY!$P$8:$P$14,MENY!$Q$8:$Q$14),\"\"))","v":"Tors"},null,null,null,null,"",0,{"$f":"IF(H29=11,\"Ordinær +\",IF(T29=1,IF(H29>0,LOOKUP(H29,MENY!$N$2:O38,MENY!$O$2:$O$18),IF(C29>0,IF(B29=\"Lør\",\"-\",\"Ordinær\"),\"-\")),\"Søndag\"))","v":"-"},null,0,0,null,0,"",null,null,"",null,1,"00:00:00",0,"00:00:00","00:00:00","00:00:00","00:00:00","00:00:00","00:00:00",0,0,0,0,0,"07:30:00","00:00:00",0,1]
["2019-02-22",{"$f":"IF(WEEKDAY(A31,2)=1,WEEKNUM(A30)*-1-MENY!$I$12,IF(WEEKDAY(A30,2)<7,LOOKUP(WEEKDAY(A30,2),MENY!$P$8:$P$14,MENY!$Q$8:$Q$14),\"\"))","v":"Fre"},null,null,null,null,"",0,{"$f":"IF(H30=11,\"Ordinær +\",IF(T30=1,IF(H30>0,LOOKUP(H30,MENY!$N$2:O39,MENY!$O$2:$O$18),IF(C30>0,IF(B30=\"Lør\",\"-\",\"Ordinær\"),\"-\")),\"Søndag\"))","v":"-"},null,0,0,null,0,"",null,null,"",null,1,"00:00:00",0,"00:00:00","00:00:00","00:00:00","00:00:00","00:00:00","00:00:00",0,0,0,0,0,"07:30:00","00:00:00",0,1]
["2019-02-23",{"$f":"IF(WEEKDAY(A32,2)=1,WEEKNUM(A31)*-1-MENY!$I$12,IF(WEEKDAY(A31,2)<7,LOOKUP(WEEKDAY(A31,2),MENY!$P$8:$P$14,MENY!$Q$8:$Q$14),\"\"))","v":"Lør"},null,null,null,null,"00:00:00",0,{"$f":"IF(H31=11,\"Ordinær +\",IF(T31=1,IF(H31>0,LOOKUP(H31,MENY!$N$2:O40,MENY!$O$2:$O$18),IF(C31>0,IF(B31=\"Lør\",\"-\",\"Ordinær\"),\"-\")),\"Søndag\"))","v":"-"},null,0,0,null,0,"",null,null,"",null,1,"","","00:00:00","","","","","",0,0,0,0,0,"07:30:00","00:00:00",0,1]
["2019-02-24",{"$f":"IF(WEEKDAY(A33,2)=1,WEEKNUM(A32)*-1-MENY!$I$12,IF(WEEKDAY(A32,2)<7,LOOKUP(WEEKDAY(A32,2),MENY!$P$8:$P$14,MENY!$Q$8:$Q$14),\"\"))","v":-9},null,null,null,null,"",0,{"$f":"IF(H32=11,\"Ordinær +\",IF(T32=1,IF(H32>0,LOOKUP(H32,MENY!$N$2:O41,MENY!$O$2:$O$18),IF(C32>0,IF(B32=\"Lør\",\"-\",\"Ordinær\"),\"-\")),\"Søndag\"))","v":"Søndag"},null,0,0,null,0,"",null,null,"",null,0,"00:00:00","","00:00:00","00:00:00","00:00:00","00:00:00","00:00:00","00:00:00",0,0,0,0,0,"07:30:00","00:00:00",0,1]
["2019-02-25",{"$f":"IF(WEEKDAY(A34,2)=1,WEEKNUM(A33)*-1-MENY!$I$12,IF(WEEKDAY(A33,2)<7,LOOKUP(WEEKDAY(A33,2),MENY!$P$8:$P$14,MENY!$Q$8:$Q$14),\"\"))","v":"Man"},null,null,null,null,"",0,{"$f":"IF(H33=11,\"Ordinær +\",IF(T33=1,IF(H33>0,LOOKUP(H33,MENY!$N$2:O42,MENY!$O$2:$O$18),IF(C33>0,IF(B33=\"Lør\",\"-\",\"Ordinær\"),\"-\")),\"Søndag\"))","v":"-"},null,0,0,null,0,"",null,null,"",null,1,"00:00:00",0,"00:00:00","00:00:00","00:00:00","00:00:00","00:00:00","00:00:00",0,0,0,0,0,"07:30:00","00:00:00",0,1]
["2019-02-26",{"$f":"IF(WEEKDAY(A35,2)=1,WEEKNUM(A34)*-1-MENY!$I$12,IF(WEEKDAY(A34,2)<7,LOOKUP(WEEKDAY(A34,2),MENY!$P$8:$P$14,MENY!$Q$8:$Q$14),\"\"))","v":"Tirs"},null,null,null,null,"",0,{"$f":"IF(H34=11,\"Ordinær +\",IF(T34=1,IF(H34>0,LOOKUP(H34,MENY!$N$2:O43,MENY!$O$2:$O$18),IF(C34>0,IF(B34=\"Lør\",\"-\",\"Ordinær\"),\"-\")),\"Søndag\"))","v":"-"},null,0,0,null,0,"",null,null,"",null,1,"00:00:00",0,"00:00:00","00:00:00","00:00:00","00:00:00","00:00:00","00:00:00",0,0,0,0,0,"07:30:00","00:00:00",0,1]
["2019-02-27",{"$f":"IF(WEEKDAY(A36,2)=1,WEEKNUM(A35)*-1-MENY!$I$12,IF(WEEKDAY(A35,2)<7,LOOKUP(WEEKDAY(A35,2),MENY!$P$8:$P$14,MENY!$Q$8:$Q$14),\"\"))","v":"Ons"},null,null,null,null,"",0,{"$f":"IF(H35=11,\"Ordinær +\",IF(T35=1,IF(H35>0,LOOKUP(H35,MENY!$N$2:O44,MENY!$O$2:$O$18),IF(C35>0,IF(B35=\"Lør\",\"-\",\"Ordinær\"),\"-\")),\"Søndag\"))","v":"-"},null,0,0,null,0,"",null,null,"",null,{"$f":"IF(A35>0,IF(WEEKDAY(A35-1)<7,1,0),\"\")","v":1},"00:00:00",0,"00:00:00","00:00:00","00:00:00","00:00:00","00:00:00","00:00:00",0,0,0,0,0,"07:30:00","00:00:00",0,1]
["2019-02-28",{"$f":"IF(WEEKDAY(A37,2)=1,WEEKNUM(A36)*-1-MENY!$I$12,IF(WEEKDAY(A36,2)<7,LOOKUP(WEEKDAY(A36,2),MENY!$P$8:$P$14,MENY!$Q$8:$Q$14),\"\"))","v":"Tors"},null,null,null,null,"",0,{"$f":"IF(H36=11,\"Ordinær +\",IF(T36=1,IF(H36>0,LOOKUP(H36,MENY!$N$2:O45,MENY!$O$2:$O$18),IF(C36>0,IF(B36=\"Lør\",\"-\",\"Ordinær\"),\"-\")),\"Søndag\"))","v":"-"},null,0,0,null,0,"",null,null,"",null,{"$f":"IF(A36>0,IF(WEEKDAY(A36-1)<7,1,0),\"\")","v":1},"00:00:00",0,"00:00:00","00:00:00","00:00:00","00:00:00","00:00:00","00:00:00",0,0,0,0,0,"07:30:00","00:00:00",0,1]
[{"$f":"IF(DAY(A36+1)>1,A36+1,0)","v":"00:00:00"},{"$f":"IF(WEEKDAY(A38,2)=1,WEEKNUM(A37)*-1-MENY!$I$12,IF(WEEKDAY(A37,2)<7,LOOKUP(WEEKDAY(A36+1,2),MENY!$P$8:$P$14,MENY!$Q$8:$Q$14),\"\"))","v":"Fre"},null,null,null,null,"",0,{"$f":"IF(A37>0,IF(H37=11,\"Ordinær +\",IF(T37=1,IF(H37>0,LOOKUP(H37,MENY!$N$2:O46,MENY!$O$2:$O$18),IF(C37>0,IF(B37=\"Lør\",\"-\",\"Ordinær\"),\"-\")),\"Søndag\")),\"-\")","v":"-"},null,0,0,null,0,"",null,null,"",null,{"$f":"IF(A37>0,IF(WEEKDAY(A37-1)<7,1,0),\"\")","v":""},"00:00:00","","00:00:00","00:00:00","00:00:00","00:00:00","00:00:00","00:00:00",0,0,0,0,0,"07:30:00","00:00:00",0,1]
[{"$f":"IF(DAY(A37+1)>1,A37+1,0)","v":"00:00:00"},null,null,null,null,null,"",0,{"$f":"IF(A38>0,IF(H38=11,\"Ordinær +\",IF(T38=1,IF(H38>0,LOOKUP(H38,MENY!$N$2:O47,MENY!$O$2:$O$18),IF(C38>0,IF(B38=\"Lør\",\"-\",\"Ordinær\"),\"-\")),\"Søndag\")),\"-\")","v":"-"},null,0,0,null,0,"",null,null,"",null,{"$f":"IF(A38>0,IF(WEEKDAY(A38-1)<7,1,0),\"\")","v":""},"00:00:00","","00:00:00","00:00:00","00:00:00","00:00:00","00:00:00","00:00:00",0,0,0,0,0,"07:30:00","00:00:00",0,1]
[{"$f":"IF(DAY(A38+1)>1,A38+1,0)","v":"00:00:00"},null,null,null,null,null,"",0,{"$f":"IF(A39>0,IF(H39=11,\"Ordinær +\",IF(T39=1,IF(H39>0,LOOKUP(H39,MENY!$N$2:O48,MENY!$O$2:$O$18),IF(C39>0,IF(B39=\"Lør\",\"-\",\"Ordinær\"),\"-\")),\"Søndag\")),\"-\")","v":"-"},null,0,0,null,0,"",null,null,"",null,{"$f":"IF(A39>0,IF(WEEKDAY(A39-1)<7,1,0),\"\")","v":""},"00:00:00","","00:00:00","00:00:00","00:00:00","00:00:00",{"$f":"IF(B39=\"Lør\",\"\",IF(T39=1,IF(H39=9,AH39,0),0))","v":"00:00:00"},"00:00:00",0,0,0,0,0,"07:30:00","00:00:00",0,1]
[null,null,null,"Sum for denne måned",null,null,{"$f":"SUM(G9:G39)*24","v":0},null,null,null,{"$f":"SUM(K9:K39)+N49","v":0},{"$f":"SUM(L9:L39)","v":0},{"$f":"SUM(M9:M39)","v":0},{"$f":"SUM(N9:N39)-U40-AG41-SUM(K40:M40)+N50","v":0},{"$f":"SUM(O9:O39)","v":0},"Fravær denne måned",null,null,null,null,{"$f":"SUM(U9:U39)*24","v":0},{"$f":"SUM(V9:V39)","v":0},{"$f":"SUM(W9:W39)*24","v":0},0,0,0,0,0,{"$f":"SUM(AC9:AC39)","v":0},{"$f":"SUM(AD9:AD39)","v":0},{"$f":"SUM(AE9:AE39)","v":0},{"$f":"SUM(AF9:AF39)","v":0},{"$f":"SUM(AG9:AG39)","v":0}]
[null,null,null,"Overført fra forrige måned",null,null,null,null,null,null,null,null,null,{"$f":"JAN!N47","v":0},{"$f":"JAN!O40","v":0},"Type","Timer",null,null,null,null,null,null,null,null,null,null,null,null,null,null,"Sum deltidsfravær:",{"$f":"SUM(AC40:AG40)","v":0}]
[null,null,null,"Sum hittil i år",null,null,null,null,null,null,null,null,null,{"$f":"SUM(N40:N41)","v":0},{"$f":"SUM(O40:O41)","v":0},"06 Perm m/lønn",{"$f":"X40+AC40*-1","v":0}]
["Ferieregnskap",null,null,"Dager","Timeregnskap",null,null,null,null,null,null,null,null,"Timer",null,"07 Perm u/lønn",{"$f":"Y40+AD40*-1","v":0}]
["Disponible feriedager",null,null,{"$f":"JAN!D47","v":25},"Opptjent denne måneden",null,null,null,null,null,null,null,null,{"$f":"SUM(N9:N39)-AG41-(SUM(K40:M40))+N50","v":0},null,"08 Sykemelding",{"$f":"(Z40+AE40*-1)","v":0}]
["Brukt denne måned",null,null,{"$f":"V40*-1","v":0},"Avspasert denne måneden",null,null,null,null,null,null,null,null,{"$f":"U40","v":0},null,"09 Egenmelding",{"$f":"(AA40+AF40*-1)","v":0}]
["Endring i feriedager",null,null,null,"Utbetalt overtid denne måned",null,null,null,null,null,null,null,null,{"$f":"SUM(K40:M40)","v":0},null,"10 Sykt barn",{"$f":"(AB40+AG40*-1)","v":0}]
["Til gode",null,null,{"$f":"SUM(D44:D46)","v":25},"Til gode for avspasering",null,null,null,null,null,null,null,null,{"$f":"N42","v":0},null,"Sum - Februar",{"$f":"SUM(Q42:Q46)","v":0}]
[null,null,null,null,"Effektiv arbeidstid denne måned",null,null,null,null,null,null,null,null,{"$f":"G40+N44+AG41+N46-N50","v":0},null,"Hittil i år",{"$f":"Q47+JAN!Q48","v":0}]
[null,null,null,null,"Flexitid omgjort til overtid og utbetalt, denne måned"]
[null,null,null,null,"Annen korrigering av flexitid, OBS! skriv egen merknad"]
["Merknader"]
[]
[]
[]
[]
[]
["Overtid for utbetaling:",null,null,null,null,null,"Dato",null,null,null,null,null,null,null,"Dato"]
[null,null,null,"Timer med 50% tillegg :",{"$f":"K40","v":0}]
[null,null,null,"Timer med 100% tillegg:",{"$f":"L40","v":0}]
[null,null,null,"Timer med 133% tillegg:",{"$f":"M39","v":0},null,null,null,"Attestert",null,null,null,null,null,"Anvist"]
[]
[]
[null,null,null,null,null,null,null,null,null,null,null,null,null,null,null,{"$f":"MENY!D6","v":"Leder"}]
["© Ole Jørgen Klaussen - 2003",null,null,null,{"$f":"TODAY()","v":"2018-11-30"},{"$f":"YEAR(TODAY())","v":2018},null,null,null,null,null,null,null,null,null,null,"ole.klaussen@online.no"]

{"sheet":"MAR","index":3,"n_rows":64,"n_cols":37,"rows_kept":64,"cut":false,"hidden":false,"merged":[[5,19,5,22],[7,7,7,8],[5,7,6,16],[7,15,7,16],[29,15,29,16],[15,15,15,16],[17,15,17,16],[11,15,11,16],[19,15,19,16],[13,15,13,16],[14,15,14,16],[18,15,18,16],[2,1,2,6],[8,15,8,16],[9,15,9,16],[10,15,10,16],[2,15,2,16],[16,15,16,16],[6,3,6,4],[30,15,30,16],[31,15,31,16],[32,15,32,16],[34,15,34,16],[33,15,33,16],[62,6,62,10],[55,0,55,16],[56,6,56,10],[56,14,56,16],[51,0,51,16],[52,0,52,16],[53,0,53,16],[54,0,54,16],[1,28,2,33],[59,14,59,16],[20,15,20,16],[12,15,12,16],[38,15,38,16],[37,15,37,16],[28,15,28,16],[21,15,21,16],[22,15,22,16],[23,15,23,16],[24,15,24,16],[25,15,25,16],[26,15,26,16],[27,15,27,16],[35,15,35,16],[36,15,36,16]]}
["Meny","JAN","FEB","MAR","APR","MAI","JUN",null,null,null,null,null,null,null,null,null,"Hjelp","Viktig når det gjelder overtid"]
["Året","JUL","AUG","SEP","OKT","NOV","DES",null,null,null,null,null,null,null,null,"Dato",null,"For at føringer av aktiv arbeidstid skal bli riktig er det"]
[null,{"$f":"MENY!D4","v":"Min bedrift"},null,null,null,null,null,null,"Mars - ",null,null,null,null,{"$f":"MENY!P1","v":2019},null,{"$f":"TODAY()","v":"2018-11-30"},null,"nødvendig at all arbeidstid registreres. Dette gjelder  også"]
[null,"Timeliste","Navn:",{"$f":"MENY!D5","v":"Min timeliste"},null,null,"Sommer",null,null,null,"Stillingsbrøk:",{"$f":"MENY!I5","v":1},null,"Vinter",null,null,null,"overtid. Registrer  når du kommer (inn) og når du går (ut)",null,null,null,null,null,null,null,null,null,null,null,null,null,null,null,null,null,"MERK!"]
[null,null,"Sommerlukking fra/til:",null,{"$f":"MENY!Q18","v":"2019-05-15"},{"$f":"MENY!Q19","v":"2019-09-14"},{"$f":"(MENY!F13-MENY!E13-MENY!I13)*MENY!I5","v":"07:30:00"},null,{"$f":"MENY!I13","v":"00:00:00"},"  <-arbeidstid->",null,null,{"$f":"MENY!I14","v":"00:00:00"},{"$f":"(MENY!F14-MENY!E14-MENY!I14)*MENY!I5","v":"07:30:00"},null,null,null,"Dersom noe av tiden skal utbetales i overtid, bruk kode 12",null,null,null,null,null,null,null,null,null,null,null,null,null,null,null,null,null,"Les her"]
["År ",null,null,null,null,null,null,"Fyll ut i arbeids og fraværskode : 0=ordinær  1=Avspasere  2=Ferie  3=Tjeneste  4=Plussdag  5=Helligdag  6=Perm M/lønn  7=Perm U/lønn  8=Sykemelding  9=Egenmelding 10=Sykt barn 11=Ordinær+ , 12 = plusstid som overtid",null,null,null,null,null,null,null,null,null,"for arbeidskode.   Fordeling mellom 50% og 100% skjer",null,"Arbeidsdata",null,null,null,null,null,null,null,null,6,7,8,9,10,null,null,"Syke-","Stillings"]
[{"$f":"N3","v":2019},{"$f":"WEEKNUM(A9)+MENY!I12","v":9},"I dag","Fravær pr dag",null,"I dag",null,null,null,null,null,null,null,null,null,null,null,"automatisk, men kan  også endres.",null,null,null,null,null,6,7,8,9,10,12,13,14,15,16,null,null,"melding","brøk"]
["DATO","UKENR                               og DAG","Inn","Ut","Inn","Ut","Ordinær","Arbeids og fraværskode",null,"Fravær",0.5,1,1.33,"Balanse","Timer i dag","Merknad ",null,"Huskeliste",null,"Arbeids dag","Avsp","Ferie","Tjeneste","Perm m-lønn","Perm u-lønn","Sykemelding","Egenmelding","Sykt barn","Perm m-lønn","Perm u-lønn","Sykemelding","Egenmelding","Sykt barn","Ordinær arbeidstid","Trekk for matpause","i prosent andel"]
[{"$f":"DATE(MENY!P1,3,1)","v":"2019-03-01"},{"$f":"IF(WEEKDAY(A10,2)=1,WEEKNUM(A9)*-1-MENY!$I$12,IF(WEEKDAY(A9,2)<7,LOOKUP(WEEKDAY(A9,2),MENY!$P$8:$P$14,MENY!$Q$8:$Q$14),\"\"))","v":"Fre"},null,null,null,null,{"$f":"IF(H9=11,F9-C9-(E9-D9),IF(B9=\"Lør\",0,IF(H9=4,0,IF(H9=3,IF(T9>0,W9,\"\"),IF(H9=1,0, IF(C9>0,  AH9,       \"\"))))))","v":""},{"$f":"IF(B9=\"Lør\",IF(C9>0,4,0),0)","v":0},{"$f":"IF(H9=11,\"Ordinær +\",IF(T9=1,IF(H9>0,LOOKUP(H9,MENY!$N$2:O18,MENY!$O$2:$O$18),IF(C9>0,IF(B9=\"Lør\",\"-\",\"Ordinær\"),\"-\")),\"Søndag\"))","v":"-"},null,{"$f":"IF(H9=12,IF(N9>=4,4,N9),0)","v":0},{"$f":"IF(H9=12,IF(N9>K9,N9-4,0),0)","v":0},null,{"$f":"IF(H9=11,0,IF(T9=1,IF(H9=4,((F9-C9)-(E9-D9))*24,IF(C9>0,(F9-C9-(E9-D9)-G9-AI9)*24,0)),0))","v":0},{"$f":"IF(F9>0,G9*24+N9,\"\")","v":""},null,null,{"$f":"IF(O9=\"\",\"\",\"Husk, fordel timer til prosjekter\")","v":""},null,{"$f":"IF(WEEKDAY(A9-1)<7,1,0)","v":1},{"$f":"IF(B9=\"Lør\",\"\",IF(T9=1,IF(H9=1,AH9,0),0))","v":"00:00:00"},{"$f":"IF(T9=1,IF(B9=\"lør\",\"\",IF(H9=2,1,0)),\"\")","v":0},{"$f":"IF(T9=1,IF(H9=3,AH9,0),0)","v":"00:00:00"},{"$f":"IF(B9=\"lør\",\"\",IF(T9=1,IF(H9=6,AH9,0),0))","v":"00:00:00"},{"$f":"IF(B9=\"Lør\",\"\",IF(T9=1,IF(H9=7,AH9,0),0))","v":"00:00:00"},{"$f":"IF(AJ9>0,IF(C9>0,    (AH9*AJ9)/(1-AJ9),0),           IF(B9=\"Lør\",\"\",IF(T9=1,IF(H9=8,AH9,0),0)))","v":"00:00:00"},{"$f":"IF(B9=\"Lør\",\"\",IF(T9=1,IF(H9=9,AH9,0),0))","v":"00:00:00"},{"$f":"IF(B9=\"Lør\",\"\",IF(T9=1,IF(H9=10,AH9,0),0))","v":"00:00:00"},{"$f":"IF(J9=6,N9,0)","v":0},{"$f":"IF(J9=7,N9,0)","v":0},{"$f":"IF(J9=8,N9,0)","v":0},{"$f":"IF(J9=9,N9,0)","v":0},{"$f":"IF(J9=10,N9,0)","v":0},{"$f":"((IF(A9<$F$5+1,IF(A9>$E$5-1,$G$5,$N$5),$N$5))*(1-AJ9))*(AK9)","v":"07:30:00"},{"$f":"IF(A9<$F$5+1,IF(A9>$E$5-1,$I$5,$M$5),$M$5)","v":"00:00:00"},{"$f":"FEB!AJ9","v":0},{"$f":"FEB!AK39","v":1}]
[{"$f":"A9+1","v":"2019-03-02"},{"$f":"IF(WEEKDAY(A11,2)=1,WEEKNUM(A10)*-1-MENY!$I$12,IF(WEEKDAY(A10,2)<7,LOOKUP(WEEKDAY(A10,2),MENY!$P$8:$P$14,MENY!$Q$8:$Q$14),\"\"))","v":"Lør"},null,null,null,null,{"$f":"IF(H10=11,F10-C10-(E10-D10),IF(B10=\"Lør\",0,IF(H10=4,0,IF(H10=3,IF(T10>0,W10,\"\"),IF(H10=1,0, IF(C10>0,  AH10,       \"\"))))))","v":"00:00:00"},0,{"$f":"IF(H10=11,\"Ordinær +\",IF(T10=1,IF(H10>0,LOOKUP(H10,MENY!$N$2:O19,MENY!$O$2:$O$18),IF(C10>0,IF(B10=\"Lør\",\"-\",\"Ordinær\"),\"-\")),\"Søndag\"))","v":"-"},null,{"$f":"IF(H10=12,IF(N10>=4,4,N10),0)","v":0},{"$f":"IF(H10=12,IF(N10>K10,N10-4,0),0)","v":0},null,{"$f":"IF(H10=11,0,IF(T10=1,IF(H10=4,((F10-C10)-(E10-D10))*24,IF(C10>0,(F10-C10-(E10-D10)-G10-AI10)*24,0)),0))","v":0},{"$f":"IF(F10>0,G10*24+N10,\"\")","v":""},null,null,{"$f":"IF(O10=\"\",\"\",\"Husk, fordel timer til prosjekter\")","v":""},null,{"$f":"IF(WEEKDAY(A10-1)<7,1,0)","v":1},{"$f":"IF(B10=\"Lør\",\"\",IF(T10=1,IF(H10=1,AH10,0),0))","v":""},"",{"$f":"IF(T10=1,IF(H10=3,AH10,0),0)","v":"00:00:00"},{"$f":"IF(B10=\"lør\",\"\",IF(T10=1,IF(H10=6,AH10,0),0))","v":""},{"$f":"IF(B10=\"Lør\",\"\",IF(T10=1,IF(H10=7,AH10,0),0))","v":""},{"$f":"IF(AJ10>0,IF(C10>0,    (AH10*AJ10)/(1-AJ10),0),           IF(B10=\"Lør\",\"\",IF(T10=1,IF(H10=8,AH10,0),0)))","v":""},{"$f":"IF(B10=\"Lør\",\"\",IF(T10=1,IF(H10=9,AH10,0),0))","v":""},{"$f":"IF(B10=\"Lør\",\"\",IF(T10=1,IF(H10=10,AH10,0),0))","v":""},0,0,0,0,0,{"$f":"((IF(A10<$F$5+1,IF(A10>$E$5-1,$G$5,$N$5),$N$5))*(1-AJ10))*(AK10)","v":"07:30:00"},{"$f":"IF(A10<$F$5+1,IF(A10>$E$5-1,$I$5,$M$5),$M$5)","v":"00:00:00"},{"$f":"AJ9","v":0},{"$f":"AK9","v":1}]
[{"$f":"A10+1","v":"2019-03-03"},{"$f":"IF(WEEKDAY(A12,2)=1,WEEKNUM(A11)*-1-MENY!$I$12,IF(WEEKDAY(A11,2)<7,LOOKUP(WEEKDAY(A11,2),MENY!$P$8:$P$14,MENY!$Q$8:$Q$14),\"\"))","v":-10},null,null,null,null,{"$f":"IF(H11=11,F11-C11-(E11-D11),IF(B11=\"Lør\",0,IF(H11=4,0,IF(H11=3,IF(T11>0,W11,\"\"),IF(H11=1,0, IF(C11>0,  AH11,       \"\"))))))","v":""},0,{"$f":"IF(H11=11,\"Ordinær +\",IF(T11=1,IF(H11>0,LOOKUP(H11,MENY!$N$2:O20,MENY!$O$2:$O$18),IF(C11>0,IF(B11=\"Lør\",\"-\",\"Ordinær\"),\"-\")),\"Søndag\"))","v":"Søndag"},null,0,0,null,0,"",null,null,"",null,0,"00:00:00","","00:00:00","00:00:00","00:00:00","00:00:00","00:00:00","00:00:00",0,0,0,0,0,"07:30:00","00:00:00",{"$f":"AJ10","v":0},{"$f":"AK10","v":1}]
["2019-03-04",{"$f":"IF(WEEKDAY(A13,2)=1,WEEKNUM(A12)*-1-MENY!$I$12,IF(WEEKDAY(A12,2)<7,LOOKUP(WEEKDAY(A12,2),MENY!$P$8:$P$14,MENY!$Q$8:$Q$14),\"\"))","v":"Man"},null,null,null,null,"",0,{"$f":"IF(H12=11,\"Ordinær +\",IF(T12=1,IF(H12>0,LOOKUP(H12,MENY!$N$2:O21,MENY!$O$2:$O$18),IF(C12>0,IF(B12=\"Lør\",\"-\",\"Ordinær\"),\"-\")),\"Søndag\"))","v":"-"},null,0,0,null,0,"",null,null,"",null,1,"00:00:00",0,"00:00:00","00:00:00","00:00:00","00:00:00","00:00:00","00:00:00",0,0,0,0,0,"07:30:00","00:00:00",0,1]
["2019-03-05",{"$f":"IF(WEEKDAY(A14,2)=1,WEEKNUM(A13)*-1-MENY!$I$12,IF(WEEKDAY(A13,2)<7,LOOKUP(WEEKDAY(A13,2),MENY!$P$8:$P$14,MENY!$Q$8:$Q$14),\"\"))","v":"Tirs"},null,null,null,null,"",0,{"$f":"IF(H13=11,\"Ordinær +\",IF(T13=1,IF(H13>0,LOOKUP(H13,MENY!$N$2:O22,MENY!$O$2:$O$18),IF(C13>0,IF(B13=\"Lør\",\"-\",\"Ordinær\"),\"-\")),\"Søndag\"))","v":"-"},null,0,0,null,0,"",null,null,"",null,1,"00:00:00",0,"00:00:00","00:00:00","00:00:00","00:00:00","00:00:00","00:00:00",0,0,0,0,0,"07:30:00","00:00:00",0,1]
["2019-03-06",{"$f":"IF(WEEKDAY(A15,2)=1,WEEKNUM(A14)*-1-MENY!$I$12,IF(WEEKDAY(A14,2)<7,LOOKUP(WEEKDAY(A14,2),MENY!$P$8:$P$14,MENY!$Q$8:$Q$14),\"\"))","v":"Ons"},null,null,null,null,"",0,{"$f":"IF(H14=11,\"Ordinær +\",IF(T14=1,IF(H14>0,LOOKUP(H14,MENY!$N$2:O23,MENY!$O$2:$O$18),IF(C14>0,IF(B14=\"Lør\",\"-\",\"Ordinær\"),\"-\")),\"Søndag\"))","v":"-"},null,0,0,null,0,"",null,null,"",null,1,"00:00:00",0,"00:00:00","00:00:00","00:00:00","00:00:00","00:00:00","00:00:00",0,0,0,0,0,"07:30:00","00:00:00",0,1]
["2019-03-07",{"$f":"IF(WEEKDAY(A16,2)=1,WEEKNUM(A15)*-1-MENY!$I$12,IF(WEEKDAY(A15,2)<7,LOOKUP(WEEKDAY(A15,2),MENY!$P$8:$P$14,MENY!$Q$8:$Q$14),\"\"))","v":"Tors"},null,null,null,null,"",0,{"$f":"IF(H15=11,\"Ordinær +\",IF(T15=1,IF(H15>0,LOOKUP(H15,MENY!$N$2:O24,MENY!$O$2:$O$18),IF(C15>0,IF(B15=\"Lør\",\"-\",\"Ordinær\"),\"-\")),\"Søndag\"))","v":"-"},null,0,0,null,0,"",null,null,"",null,1,"00:00:00",0,"00:00:00","00:00:00","00:00:00","00:00:00","00:00:00","00:00:00",0,0,0,0,0,"07:30:00","00:00:00",0,1]
["2019-03-08",{"$f":"IF(WEEKDAY(A17,2)=1,WEEKNUM(A16)*-1-MENY!$I$12,IF(WEEKDAY(A16,2)<7,LOOKUP(WEEKDAY(A16,2),MENY!$P$8:$P$14,MENY!$Q$8:$Q$14),\"\"))","v":"Fre"},null,null,null,null,"",0,{"$f":"IF(H16=11,\"Ordinær +\",IF(T16=1,IF(H16>0,LOOKUP(H16,MENY!$N$2:O25,MENY!$O$2:$O$18),IF(C16>0,IF(B16=\"Lør\",\"-\",\"Ordinær\"),\"-\")),\"Søndag\"))","v":"-"},null,0,0,null,0,"",null,null,"",null,1,"00:00:00",0,"00:00:00","00:00:00","00:00:00","00:00:00","00:00:00","00:00:00",0,0,0,0,0,"07:30:00","00:00:00",0,1]
["2019-03-09",{"$f":"IF(WEEKDAY(A18,2)=1,WEEKNUM(A17)*-1-MENY!$I$12,IF(WEEKDAY(A17,2)<7,LOOKUP(WEEKDAY(A17,2),MENY!$P$8:$P$14,MENY!$Q$8:$Q$14),\"\"))","v":"Lør"},null,null,null,null,"00:00:00",0,{"$f":"IF(H17=11,\"Ordinær +\",IF(T17=1,IF(H17>0,LOOKUP(H17,MENY!$N$2:O26,MENY!$O$2:$O$18),IF(C17>0,IF(B17=\"Lør\",\"-\",\"Ordinær\"),\"-\")),\"Søndag\"))","v":"-"},null,0,0,null,0,"",null,null,"",null,1,"","","00:00:00","","","","","",0,0,0,0,0,"07:30:00","00:00:00",0,1]
["2019-03-10",{"$f":"IF(WEEKDAY(A19,2)=1,WEEKNUM(A18)*-1-MENY!$I$12,IF(WEEKDAY(A18,2)<7,LOOKUP(WEEKDAY(A18,2),MENY!$P$8:$P$14,MENY!$Q$8:$Q$14),\"\"))","v":-11},null,null,null,null,"",0,{"$f":"IF(H18=11,\"Ordinær +\",IF(T18=1,IF(H18>0,LOOKUP(H18,MENY!$N$2:O27,MENY!$O$2:$O$18),IF(C18>0,IF(B18=\"Lør\",\"-\",\"Ordinær\"),\"-\")),\"Søndag\"))","v":"Søndag"},null,0,0,null,0,"",null,null,"",null,0,"00:00:00","","00:00:00","00:00:00","00:00:00","00:00:00","00:00:00","00:00:00",0,0,0,0,0,"07:30:00","00:00:00",0,1]
["2019-03-11",{"$f":"IF(WEEKDAY(A20,2)=1,WEEKNUM(A19)*-1-MENY!$I$12,IF(WEEKDAY(A19,2)<7,LOOKUP(WEEKDAY(A19,2),MENY!$P$8:$P$14,MENY!$Q$8:$Q$14),\"\"))","v":"Man"},null,null,null,null,"",0,{"$f":"IF(H19=11,\"Ordinær +\",IF(T19=1,IF(H19>0,LOOKUP(H19,MENY!$N$2:O28,MENY!$O$2:$O$18),IF(C19>0,IF(B19=\"Lør\",\"-\",\"Ordinær\"),\"-\")),\"Søndag\"))","v":"-"},null,0,0,null,0,"",null,null,"",null,1,"00:00:00",0,"00:00:00","00:00:00","00:00:00","00:00:00","00:00:00","00:00:00",0,0,0,0,0,"07:30:00","00:00:00",0,1]
["2019-03-12",{"$f":"IF(WEEKDAY(A21,2)=1,WEEKNUM(A20)*-1-MENY!$I$12,IF(WEEKDAY(A20,2)<7,LOOKUP(WEEKDAY(A20,2),MENY!$P$8:$P$14,MENY!$Q$8:$Q$14),\"\"))","v":"Tirs"},null,null,null,null,"",0,{"$f":"IF(H20=11,\"Ordinær +\",IF(T20=1,IF(H20>0,LOOKUP(H20,MENY!$N$2:O29,MENY!$O$2:$O$18),IF(C20>0,IF(B20=\"Lør\",\"-\",\"Ordinær\"),\"-\")),\"Søndag\"))","v":"-"},null,0,0,null,0,"",null,null,"",null,1,"00:00:00",0,"00:00:00","00:00:00","00:00:00","00:00:00","00:00:00","00:00:00",0,0,0,0,0,"07:30:00","00:00:00",0,1]
["2019-03-13",{"$f":"IF(WEEKDAY(A22,2)=1,WEEKNUM(A21)*-1-MENY!$I$12,IF(WEEKDAY(A21,2)<7,LOOKUP(WEEKDAY(A21,2),MENY!$P$8:$P$14,MENY!$Q$8:$Q$14),\"\"))","v":"Ons"},null,null,null,null,"",0,{"$f":"IF(H21=11,\"Ordinær +\",IF(T21=1,IF(H21>0,LOOKUP(H21,MENY!$N$2:O30,MENY!$O$2:$O$18),IF(C21>0,IF(B21=\"Lør\",\"-\",\"Ordinær\"),\"-\")),\"Søndag\"))","v":"-"},null,0,0,null,0,"",null,null,"",null,1,"00:00:00",0,"00:00:00","00:00:00","00:00:00","00:00:00","00:00:00","00:00:00",0,0,0,0,0,"07:30:00","00:00:00",0,1]
["2019-03-14",{"$f":"IF(WEEKDAY(A23,2)=1,WEEKNUM(A22)*-1-MENY!$I$12,IF(WEEKDAY(A22,2)<7,LOOKUP(WEEKDAY(A22,2),MENY!$P$8:$P$14,MENY!$Q$8:$Q$14),\"\"))","v":"Tors"},null,null,null,null,"",0,{"$f":"IF(H22=11,\"Ordinær +\",IF(T22=1,IF(H22>0,LOOKUP(H22,MENY!$N$2:O31,MENY!$O$2:$O$18),IF(C22>0,IF(B22=\"Lør\",\"-\",\"Ordinær\"),\"-\")),\"Søndag\"))","v":"-"},null,0,0,null,0,"",null,null,"",null,1,"00:00:00",0,"00:00:00","00:00:00","00:00:00","00:00:00","00:00:00","00:00:00",0,0,0,0,0,"07:30:00","00:00:00",0,1]
["2019-03-15",{"$f":"IF(WEEKDAY(A24,2)=1,WEEKNUM(A23)*-1-MENY!$I$12,IF(WEEKDAY(A23,2)<7,LOOKUP(WEEKDAY(A23,2),MENY!$P$8:$P$14,MENY!$Q$8:$Q$14),\"\"))","v":"Fre"},null,null,null,null,"",0,{"$f":"IF(H23=11,\"Ordinær +\",IF(T23=1,IF(H23>0,LOOKUP(H23,MENY!$N$2:O32,MENY!$O$2:$O$18),IF(C23>0,IF(B23=\"Lør\",\"-\",\"Ordinær\"),\"-\")),\"Søndag\"))","v":"-"},null,0,0,null,0,"",null,null,"",null,1,"00:00:00",0,"00:00:00","00:00:00","00:00:00","00:00:00","00:00:00","00:00:00",0,0,0,0,0,"07:30:00","00:00:00",0,1]
["2019-03-16",{"$f":"IF(WEEKDAY(A25,2)=1,WEEKNUM(A24)*-1-MENY!$I$12,IF(WEEKDAY(A24,2)<7,LOOKUP(WEEKDAY(A24,2),MENY!$P$8:$P$14,MENY!$Q$8:$Q$14),\"\"))","v":"Lør"},null,null,null,null,"00:00:00",0,{"$f":"IF(H24=11,\"Ordinær +\",IF(T24=1,IF(H24>0,LOOKUP(H24,MENY!$N$2:O33,MENY!$O$2:$O$18),IF(C24>0,IF(B24=\"Lør\",\"-\",\"Ordinær\"),\"-\")),\"Søndag\"))","v":"-"},null,0,0,null,0,"",null,null,"",null,1,"","","00:00:00","","","","","",0,0,0,0,0,"07:30:00","00:00:00",0,1]
["2019-03-17",{"$f":"IF(WEEKDAY(A26,2)=1,WEEKNUM(A25)*-1-MENY!$I$12,IF(WEEKDAY(A25,2)<7,LOOKUP(WEEKDAY(A25,2),MENY!$P$8:$P$14,MENY!$Q$8:$Q$14),\"\"))","v":-12},null,null,null,null,"",0,{"$f":"IF(H25=11,\"Ordinær +\",IF(T25=1,IF(H25>0,LOOKUP(H25,MENY!$N$2:O34,MENY!$O$2:$O$18),IF(C25>0,IF(B25=\"Lør\",\"-\",\"Ordinær\"),\"-\")),\"Søndag\"))","v":"Søndag"},null,0,0,null,0,"",null,null,"",null,0,"00:00:00","","00:00:00","00:00:00","00:00:00","00:00:00","00:00:00","00:00:00",0,0,0,0,0,"07:30:00","00:00:00",0,1]
["2019-03-18",{"$f":"IF(WEEKDAY(A27,2)=1,WEEKNUM(A26)*-1-MENY!$I$12,IF(WEEKDAY(A26,2)<7,LOOKUP(WEEKDAY(A26,2),MENY!$P$8:$P$14,MENY!$Q$8:$Q$14),\"\"))","v":"Man"},null,null,null,null,"",0,{"$f":"IF(H26=11,\"Ordinær +\",IF(T26=1,IF(H26>0,LOOKUP(H26,MENY!$N$2:O35,MENY!$O$2:$O$18),IF(C26>0,IF(B26=\"Lør\",\"-\",\"Ordinær\"),\"-\")),\"Søndag\"))","v":"-"},null,0,0,null,0,"",null,null,"",null,1,"00:00:00",0,"00:00:00","00:00:00","00:00:00","00:00:00","00:00:00","00:00:00",0,0,0,0,0,"07:30:00","00:00:00",0,1]
["2019-03-19",{"$f":"IF(WEEKDAY(A28,2)=1,WEEKNUM(A27)*-1-MENY!$I$12,IF(WEEKDAY(A27,2)<7,LOOKUP(WEEKDAY(A27,2),MENY!$P$8:$P$14,MENY!$Q$8:$Q$14),\"\"))","v":"Tirs"},null,null,null,null,"",0,{"$f":"IF(H27=11,\"Ordinær +\",IF(T27=1,IF(H27>0,LOOKUP(H27,MENY!$N$2:O36,MENY!$O$2:$O$18),IF(C27>0,IF(B27=\"Lør\",\"-\",\"Ordinær\"),\"-\")),\"Søndag\"))","v":"-"},null,0,0,null,0,"",null,null,"",null,1,"00:00:00",0,"00:00:00","00:00:00","00:00:00","00:00:00","00:00:00","00:00:00",0,0,0,0,0,"07:30:00","00:00:00",0,1]
["2019-03-20",{"$f":"IF(WEEKDAY(A29,2)=1,WEEKNUM(A28)*-1-MENY!$I$12,IF(WEEKDAY(A28,2)<7,LOOKUP(WEEKDAY(A28,2),MENY!$P$8:$P$14,MENY!$Q$8:$Q$14),\"\"))","v":"Ons"},null,null,null,null,"",0,{"$f":"IF(H28=11,\"Ordinær +\",IF(T28=1,IF(H28>0,LOOKUP(H28,MENY!$N$2:O37,MENY!$O$2:$O$18),IF(C28>0,IF(B28=\"Lør\",\"-\",\"Ordinær\"),\"-\")),\"Søndag\"))","v":"-"},null,0,0,null,0,"",null,null,"",null,1,"00:00:00",0,"00:00:00","00:00:00","00:00:00","00:00:00","00:00:00","00:00:00",0,0,0,0,0,"07:30:00","00:00:00",0,1]
["2019-03-21",{"$f":"IF(WEEKDAY(A30,2)=1,WEEKNUM(A29)*-1-MENY!$I$12,IF(WEEKDAY(A29,2)<7,LOOKUP(WEEKDAY(A29,2),MENY!$P$8:$P$14,MENY!$Q$8:$Q$14),\"\"))","v":"Tors"},null,null,null,null,"",0,{"$f":"IF(H29=11,\"Ordinær +\",IF(T29=1,IF(H29>0,LOOKUP(H29,MENY!$N$2:O38,MENY!$O$2:$O$18),IF(C29>0,IF(B29=\"Lør\",\"-\",\"Ordinær\"),\"-\")),\"Søndag\"))","v":"-"},null,0,0,null,0,"",null,null,"",null,1,"00:00:00",0,"00:00:00","00:00:00","00:00:00","00:00:00","00:00:00","00:00:00",0,0,0,0,0,"07:30:00","00:00:00",0,1]
["2019-03-22",{"$f":"IF(WEEKDAY(A31,2)=1,WEEKNUM(A30)*-1-MENY!$I$12,IF(WEEKDAY(A30,2)<7,LOOKUP(WEEKDAY(A30,2),MENY!$P$8:$P$14,MENY!$Q$8:$Q$14),\"\"))","v":"Fre"},null,null,null,null,"",0,{"$f":"IF(H30=11,\"Ordinær +\",IF(T30=1,IF(H30>0,LOOKUP(H30,MENY!$N$2:O39,MENY!$O$2:$O$18),IF(C30>0,IF(B30=\"Lør\",\"-\",\"Ordinær\"),\"-\")),\"Søndag\"))","v":"-"},null,0,0,null,0,"",null,null,"",null,1,"00:00:00",0,"00:00:00","00:00:00","00:00:00","00:00:00","00:00:00","00:00:00",0,0,0,0,0,"07:30:00","00:00:00",0,1]
["2019-03-23",{"$f":"IF(WEEKDAY(A32,2)=1,WEEKNUM(A31)*-1-MENY!$I$12,IF(WEEKDAY(A31,2)<7,LOOKUP(WEEKDAY(A31,2),MENY!$P$8:$P$14,MENY!$Q$8:$Q$14),\"\"))","v":"Lør"},null,null,null,null,"00:00:00",0,{"$f":"IF(H31=11,\"Ordinær +\",IF(T31=1,IF(H31>0,LOOKUP(H31,MENY!$N$2:O40,MENY!$O$2:$O$18),IF(C31>0,IF(B31=\"Lør\",\"-\",\"Ordinær\"),\"-\")),\"Søndag\"))","v":"-"},null,0,0,null,0,"",null,null,"",null,1,"","","00:00:00","","","","","",0,0,0,0,0,"07:30:00","00:00:00",0,1]
["2019-03-24",{"$f":"IF(WEEKDAY(A33,2)=1,WEEKNUM(A32)*-1-MENY!$I$12,IF(WEEKDAY(A32,2)<7,LOOKUP(WEEKDAY(A32,2),MENY!$P$8:$P$14,MENY!$Q$8:$Q$14),\"\"))","v":-13},null,null,null,null,"",0,{"$f":"IF(H32=11,\"Ordinær +\",IF(T32=1,IF(H32>0,LOOKUP(H32,MENY!$N$2:O41,MENY!$O$2:$O$18),IF(C32>0,IF(B32=\"Lør\",\"-\",\"Ordinær\"),\"-\")),\"Søndag\"))","v":"Søndag"},null,0,0,null,0,"",null,null,"",null,0,"00:00:00","","00:00:00","00:00:00","00:00:00","00:00:00","00:00:00","00:00:00",0,0,0,0,0,"07:30:00","00:00:00",0,1]
["2019-03-25",{"$f":"IF(WEEKDAY(A34,2)=1,WEEKNUM(A33)*-1-MENY!$I$12,IF(WEEKDAY(A33,2)<7,LOOKUP(WEEKDAY(A33,2),MENY!$P$8:$P$14,MENY!$Q$8:$Q$14),\"\"))","v":"Man"},null,null,null,null,"",0,{"$f":"IF(H33=11,\"Ordinær +\",IF(T33=1,IF(H33>0,LOOKUP(H33,MENY!$N$2:O42,MENY!$O$2:$O$18),IF(C33>0,IF(B33=\"Lør\",\"-\",\"Ordinær\"),\"-\")),\"Søndag\"))","v":"-"},null,0,0,null,0,"",null,null,"",null,1,"00:00:00",0,"00:00:00","00:00:00","00:00:00","00:00:00","00:00:00","00:00:00",0,0,0,0,0,"07:30:00","00:00:00",0,1]
["2019-03-26",{"$f":"IF(WEEKDAY(A35,2)=1,WEEKNUM(A34)*-1-MENY!$I$12,IF(WEEKDAY(A34,2)<7,LOOKUP(WEEKDAY(A34,2),MENY!$P$8:$P$14,MENY!$Q$8:$Q$14),\"\"))","v":"Tirs"},null,null,null,null,"",0,{"$f":"IF(H34=11,\"Ordinær +\",IF(T34=1,IF(H34>0,LOOKUP(H34,MENY!$N$2:O43,MENY!$O$2:$O$18),IF(C34>0,IF(B34=\"Lør\",\"-\",\"Ordinær\"),\"-\")),\"Søndag\"))","v":"-"},null,0,0,null,0,"",null,null,"",null,1,"00:00:00",0,"00:00:00","00:00:00","00:00:00","00:00:00","00:00:00","00:00:00",0,0,0,0,0,"07:30:00","00:00:00",0,1]
["2019-03-27",{"$f":"IF(WEEKDAY(A36,2)=1,WEEKNUM(A35)*-1-MENY!$I$12,IF(WEEKDAY(A35,2)<7,LOOKUP(WEEKDAY(A35,2),MENY!$P$8:$P$14,MENY!$Q$8:$Q$14),\"\"))","v":"Ons"},null,null,null,null,"",0,{"$f":"IF(H35=11,\"Ordinær +\",IF(T35=1,IF(H35>0,LOOKUP(H35,MENY!$N$2:O44,MENY!$O$2:$O$18),IF(C35>0,IF(B35=\"Lør\",\"-\",\"Ordinær\"),\"-\")),\"Søndag\"))","v":"-"},null,0,0,null,0,"",null,null,"",null,{"$f":"IF(A35>0,IF(WEEKDAY(A35-1)<7,1,0),\"\")","v":1},"00:00:00",0,"00:00:00","00:00:00","00:00:00","00:00:00","00:00:00","00:00:00",0,0,0,0,0,"07:30:00","00:00:00",0,1]
["2019-03-28",{"$f":"IF(WEEKDAY(A37,2)=1,WEEKNUM(A36)*-1-MENY!$I$12,IF(WEEKDAY(A36,2)<7,LOOKUP(WEEKDAY(A36,2),MENY!$P$8:$P$14,MENY!$Q$8:$Q$14),\"\"))","v":"Tors"},null,null,null,null,"",0,{"$f":"IF(H36=11,\"Ordinær +\",IF(T36=1,IF(H36>0,LOOKUP(H36,MENY!$N$2:O45,MENY!$O$2:$O$18),IF(C36>0,IF(B36=\"Lør\",\"-\",\"Ordinær\"),\"-\")),\"Søndag\"))","v":"-"},null,0,0,null,0,"",null,null,"",null,{"$f":"IF(A36>0,IF(WEEKDAY(A36-1)<7,1,0),\"\")","v":1},"00:00:00",0,"00:00:00","00:00:00","00:00:00","00:00:00","00:00:00","00:00:00",0,0,0,0,0,"07:30:00","00:00:00",0,1]
["2019-03-29",{"$f":"IF(WEEKDAY(A38,2)=1,WEEKNUM(A37)*-1-MENY!$I$12,IF(WEEKDAY(A37,2)<7,LOOKUP(WEEKDAY(A37,2),MENY!$P$8:$P$14,MENY!$Q$8:$Q$14),\"\"))","v":"Fre"},null,null,null,null,"",0,{"$f":"IF(H37=11,\"Ordinær +\",IF(T37=1,IF(H37>0,LOOKUP(H37,MENY!$N$2:O46,MENY!$O$2:$O$18),IF(C37>0,IF(B37=\"Lør\",\"-\",\"Ordinær\"),\"-\")),\"Søndag\"))","v":"-"},null,0,0,null,0,"",null,null,"",null,{"$f":"IF(A37>0,IF(WEEKDAY(A37-1)<7,1,0),\"\")","v":1},"00:00:00",0,"00:00:00","00:00:00","00:00:00","00:00:00","00:00:00","00:00:00",0,0,0,0,0,"07:30:00","00:00:00",0,1]
["2019-03-30",{"$f":"IF(WEEKDAY(A39,2)=1,WEEKNUM(A38)*-1-MENY!$I$12,IF(WEEKDAY(A38,2)<7,LOOKUP(WEEKDAY(A38,2),MENY!$P$8:$P$14,MENY!$Q$8:$Q$14),\"\"))","v":"Lør"},null,null,null,null,"00:00:00",0,{"$f":"IF(H38=11,\"Ordinær +\",IF(T38=1,IF(H38>0,LOOKUP(H38,MENY!$N$2:O47,MENY!$O$2:$O$18),IF(C38>0,IF(B38=\"Lør\",\"-\",\"Ordinær\"),\"-\")),\"Søndag\"))","v":"-"},null,0,0,null,0,"",null,null,"",null,{"$f":"IF(A38>0,IF(WEEKDAY(A38-1)<7,1,0),\"\")","v":1},"","","00:00:00","","","","","",0,0,0,0,0,"07:30:00","00:00:00",0,1]
["2019-03-31",{"$f":"IF(WEEKDAY(A40,2)=1,WEEKNUM(A39)*-1-MENY!$I$12,IF(WEEKDAY(A39,2)<7,LOOKUP(WEEKDAY(A39,2),MENY!$P$8:$P$14,MENY!$Q$8:$Q$14),\"\"))","v":""},null,null,null,null,"",0,{"$f":"IF(H39=11,\"Ordinær +\",IF(T39=1,IF(H39>0,LOOKUP(H39,MENY!$N$2:O48,MENY!$O$2:$O$18),IF(C39>0,IF(B39=\"Lør\",\"-\",\"Ordinær\"),\"-\")),\"Søndag\"))","v":"Søndag"},null,0,0,null,0,"",null,null,"",null,{"$f":"IF(A39>0,IF(WEEKDAY(A39-1)<7,1,0),\"\")","v":0},"00:00:00","","00:00:00","00:00:00","00:00:00","00:00:00",{"$f":"IF(B39=\"Lør\",\"\",IF(T39=1,IF(H39=9,AH39,0),0))","v":"00:00:00"},"00:00:00",0,0,0,0,0,"07:30:00","00:00:00",0,1]
[null,null,null,"Sum for denne måned",null,null,{"$f":"SUM(G9:G39)*24","v":0},null,null,null,{"$f":"SUM(K9:K39)+N49","v":0},{"$f":"SUM(L9:L39)","v":0},{"$f":"SUM(M9:M39)","v":0},{"$f":"SUM(N9:N39)-U40-AG41-SUM(K40:M40)+N50","v":0},{"$f":"SUM(O9:O39)","v":0},"Fravær denne måned",null,null,null,null,{"$f":"SUM(U9:U39)*24","v":0},{"$f":"SUM(V9:V39)","v":0},{"$f":"SUM(W9:W39)*24","v":0},0,0,0,0,0,{"$f":"SUM(AC9:AC39)","v":0},{"$f":"SUM(AD9:AD39)","v":0},{"$f":"SUM(AE9:AE39)","v":0},{"$f":"SUM(AF9:AF39)","v":0},{"$f":"SUM(AG9:AG39)","v":0}]
[null,null,null,"Overført fra forrige måned",null,null,null,null,null,null,null,null,null,{"$f":"FEB!N47","v":0},{"$f":"FEB!O42","v":0},"Type","Timer",null,null,null,null,null,null,null,null,null,null,null,null,null,null,"Sum deltidsfravær:",{"$f":"SUM(AC40:AG40)","v":0}]
[null,null,null,"Sum hittil i år",null,null,null,null,null,null,null,null,null,{"$f":"SUM(N40:N41)","v":0},{"$f":"SUM(O40:O41)","v":0},"06 Perm m/lønn",{"$f":"X40+AC40*-1","v":0}]
["Ferieregnskap",null,null,"Dager","Timeregnskap",null,null,null,null,null,null,null,null,"Timer",null,"07 Perm u/lønn",{"$f":"Y40+AD40*-1","v":0}]
["Disponible feriedager",null,null,{"$f":"FEB!D47","v":25},"Opptjent denne måneden",null,null,null,null,null,null,null,null,{"$f":"SUM(N9:N39)-AG41-(SUM(K40:M40))+N50","v":0},null,"08 Sykemelding",{"$f":"(Z40+AE40*-1)","v":0}]
["Brukt denne måned",null,null,{"$f":"V40*-1","v":0},"Avspasert denne måneden",null,null,null,null,null,null,null,null,{"$f":"U40","v":0},null,"09 Egenmelding",{"$f":"(AA40+AF40*-1)","v":0}]
["Endring i feriedager",null,null,null,"Utbetalt overtid denne måned",null,null,null,null,null,null,null,null,{"$f":"SUM(K40:M40)","v":0},null,"10 Sykt barn",{"$f":"(AB40+AG40*-1)","v":0}]
["Til gode",null,null,{"$f":"SUM(D44:D46)","v":25},"Til gode for avspasering",null,null,null,null,null,null,null,null,{"$f":"N42","v":0},null,"Sum - Mars",{"$f":"SUM(Q42:Q46)","v":0}]
[null,null,null,null,"Effektiv arbeidstid denne måned",null,null,null,null,null,null,null,null,{"$f":"G40+N44+AG41+N46-N50","v":0},null,"Hittil i år",{"$f":"Q47+FEB!Q48","v":0}]
[null,null,null,null,"Flexitid omgjort til overtid og utbetalt, denne måned"]
[null,null,null,null,"Annen korrigering av flexitid, OBS! skriv egen merknad"]
["Merknader"]
[]
[]
[]
[]
[]
["Overtid for utbetaling:",null,null,null,null,null,"Dato",null,null,null,null,null,null,null,"Dato"]
[null,null,null,"Timer med 50% tillegg :",{"$f":"K40","v":0}]
[null,null,null,"Timer med 100% tillegg:",{"$f":"L40","v":0}]
[null,null,null,"Timer med 133% tillegg:",{"$f":"M39","v":0},null,null,null,"Attestert",null,null,null,null,null,"Anvist"]
[]
[]
[null,null,null,null,null,null,null,null,null,null,null,null,null,null,null,{"$f":"MENY!D6","v":"Leder"}]
["© Ole Jørgen Klaussen - 2003",null,null,null,{"$f":"TODAY()","v":"2018-11-30"},{"$f":"YEAR(TODAY())","v":2018},null,null,null,null,null,null,null,null,null,null,"ole.klaussen@online.no"]

{"sheet":"APR","index":4,"n_rows":64,"n_cols":37,"rows_kept":64,"cut":false,"hidden":false,"merged":[[11,15,11,16],[12,15,12,16],[13,15,13,16],[14,15,14,16],[5,19,5,22],[5,7,6,16],[2,1,2,6],[8,15,8,16],[9,15,9,16],[10,15,10,16],[2,15,2,16],[7,15,7,16],[6,3,6,4],[7,7,7,8],[15,15,15,16],[18,15,18,16],[19,15,19,16],[20,15,20,16],[16,15,16,16],[17,15,17,16],[38,15,38,16],[37,15,37,16],[36,15,36,16],[30,15,30,16],[31,15,31,16],[32,15,32,16],[33,15,33,16],[26,15,26,16],[27,15,27,16],[29,15,29,16],[34,15,34,16],[35,15,35,16],[1,28,2,33],[59,14,59,16],[62,6,62,10],[55,0,55,16],[56,6,56,10],[56,14,56,16],[51,0,51,16],[52,0,52,16],[53,0,53,16],[54,0,54,16],[28,15,28,16],[21,15,21,16],[22,15,22,16],[23,15,23,16],[24,15,24,16],[25,15,25,16]]}
["Meny","JAN","FEB","MAR","APR","MAI","JUN",null,null,null,null,null,null,null,null,null,"Hjelp","Viktig når det gjelder overtid"]
["Året","JUL","AUG","SEP","OKT","NOV","DES",null,null,null,null,null,null,null,null,"Dato",null,"For at føringer av aktiv arbeidstid skal bli riktig"]
[null,{"$f":"MENY!D4","v":"Min bedrift"},null,null,null,null,null,null,"April -",null,null,null,null,{"$f":"MENY!P1","v":2019},null,{"$f":"TODAY()","v":"2018-11-30"},null,"er det nødvendig at all arbeidstid registreres."]
[null,"Timeliste","Navn:",{"$f":"MENY!D5","v":"Min timeliste"},null,null,"Sommer",null,null,null,"Stillingsbrøk:",{"$f":"MENY!I5","v":1},null,"Vinter",null,null,null,"Dette gjelder også overtid. Så registrer  når du ",null,null,null,null,null,null,null,null,null,null,null,null,null,null,null,null,null,"MERK!"]
[null,null,"Sommerlukking fra/til:",null,{"$f":"MENY!Q18","v":"2019-05-15"},{"$f":"MENY!Q19","v":"2019-09-14"},{"$f":"(MENY!F13-MENY!E13-MENY!I13)*MENY!I5","v":"07:30:00"},null,{"$f":"MENY!I13","v":"00:00:00"},"  <-arbeidstid->",null,null,{"$f":"MENY!I14","v":"00:00:00"},{"$f":"(MENY!F14-MENY!E14-MENY!I14)*MENY!I5","v":"07:30:00"},null,null,null,"kommer på jobb (inn) og når du er ferdig (ut)",null,null,null,null,null,null,null,null,null,null,null,null,null,null,null,null,null,"Les her"]
["År ",null,null,null,null,null,null,"Fyll ut i arbeids og fraværskode : 0=ordinær  1=Avspasere  2=Ferie  3=Tjeneste  4=Plussdag  5=Helligdag  6=Perm M/lønn  7=Perm U/lønn  8=Sykemelding  9=Egenmelding 10=Sykt barn 11=Ordinær+ , 12 = plusstid som overtid",null,null,null,null,null,null,null,null,null,"Dersom noe av tiden skal utbetales i overtid, så",null,"Arbeidsdata",null,null,null,null,null,null,null,null,6,7,8,9,10,null,null,"Syke-","Stillings"]
[{"$f":"N3","v":2019},{"$f":"WEEKNUM(A9)+MENY!I12","v":14},"I dag","Fravær pr dag",null,"I dag",null,null,null,null,null,null,null,null,null,null,null,"legg inn antall timer nederst på arket.",null,null,null,null,null,6,7,8,9,10,12,13,14,15,16,null,null,"melding","brøk"]
["DATO","UKENR                               og DAG","Inn","Ut","Inn","Ut","Ordinær","Arbeids og fraværskode",null,"Fravær",0.5,1,1.33,"Balanse","Timer i dag","Merknad ",null,"Huskeliste",null,"Arbeids dag","Avsp","Ferie","Tjeneste","Perm m-lønn","Perm u-lønn","Sykemelding","Egenmelding","Sykt barn","Perm m-lønn","Perm u-lønn","Sykemelding","Egenmelding","Sykt barn","Ordinær arbeidstid","Trekk for matpause","i prosent andel"]
[{"$f":"DATE(MENY!P1,4,1)","v":"2019-04-01"},{"$f":"IF(WEEKDAY(A10,2)=1,WEEKNUM(A9)*-1-MENY!$I$12,IF(WEEKDAY(A9,2)<7,LOOKUP(WEEKDAY(A9,2),MENY!$P$8:$P$14,MENY!$Q$8:$Q$14),\"\"))","v":"Man"},null,null,null,null,{"$f":"IF(H9=11,F9-C9-(E9-D9),IF(B9=\"Lør\",0,IF(H9=4,0,IF(H9=3,IF(T9>0,W9,\"\"),IF(H9=1,0, IF(C9>0,  AH9,       \"\"))))))","v":""},{"$f":"IF(B9=\"Lør\",IF(C9>0,4,0),0)","v":0},{"$f":"IF(H9=11,\"Ordinær +\",IF(T9=1,IF(H9>0,LOOKUP(H9,MENY!$N$2:O18,MENY!$O$2:$O$18),IF(C9>0,IF(B9=\"Lør\",\"-\",\"Ordinær\"),\"-\")),\"Søndag\"))","v":"-"},null,{"$f":"IF(H9=12,IF(N9>=4,4,N9),0)","v":0},{"$f":"IF(H9=12,IF(N9>K9,N9-4,0),0)","v":0},null,{"$f":"IF(H9=11,0,IF(T9=1,IF(H9=4,((F9-C9)-(E9-D9))*24,IF(C9>0,(F9-C9-(E9-D9)-G9-AI9)*24,0)),0))","v":0},{"$f":"IF(F9>0,G9*24+N9,\"\")","v":""},null,null,{"$f":"IF(O9=\"\",\"\",\"Husk, fordel timer til prosjekter\")","v":""},null,{"$f":"IF(WEEKDAY(A9-1)<7,1,0)","v":1},{"$f":"IF(B9=\"Lør\",\"\",IF(T9=1,IF(H9=1,AH9,0),0))","v":"00:00:00"},{"$f":"IF(T9=1,IF(B9=\"lør\",\"\",IF(H9=2,1,0)),\"\")","v":0},{"$f":"IF(T9=1,IF(H9=3,AH9,0),0)","v":"00:00:00"},{"$f":"IF(B9=\"lør\",\"\",IF(T9=1,IF(H9=6,AH9,0),0))","v":"00:00:00"},{"$f":"IF(B9=\"Lør\",\"\",IF(T9=1,IF(H9=7,AH9,0),0))","v":"00:00:00"},{"$f":"IF(AJ9>0,IF(C9>0,    (AH9*AJ9)/(1-AJ9),0),           IF(B9=\"Lør\",\"\",IF(T9=1,IF(H9=8,AH9,0),0)))","v":"00:00:00"},{"$f":"IF(B9=\"Lør\",\"\",IF(T9=1,IF(H9=9,AH9,0),0))","v":"00:00:00"},{"$f":"IF(B9=\"Lør\",\"\",IF(T9=1,IF(H9=10,AH9,0),0))","v":"00:00:00"},{"$f":"IF(J9=6,N9,0)","v":0},{"$f":"IF(J9=7,N9,0)","v":0},{"$f":"IF(J9=8,N9,0)","v":0},{"$f":"IF(J9=9,N9,0)","v":0},{"$f":"IF(J9=10,N9,0)","v":0},{"$f":"((IF(A9<$F$5+1,IF(A9>$E$5-1,$G$5,$N$5),$N$5))*(1-AJ9))*(AK9)","v":"07:30:00"},{"$f":"IF(A9<$F$5+1,IF(A9>$E$5-1,$I$5,$M$5),$M$5)","v":"00:00:00"},{"$f":"MAR!AJ39","v":0},{"$f":"MAR!AK39","v":1}]
[{"$f":"A9+1","v":"2019-04-02"},{"$f":"IF(WEEKDAY(A11,2)=1,WEEKNUM(A10)*-1-MENY!$I$12,IF(WEEKDAY(A10,2)<7,LOOKUP(WEEKDAY(A10,2),MENY!$P$8:$P$14,MENY!$Q$8:$Q$14),\"\"))","v":"Tirs"},null,null,null,null,{"$f":"IF(H10=11,F10-C10-(E10-D10),IF(B10=\"Lør\",0,IF(H10=4,0,IF(H10=3,IF(T10>0,W10,\"\"),IF(H10=1,0, IF(C10>0,  AH10,       \"\"))))))","v":""},0,{"$f":"IF(H10=11,\"Ordinær +\",IF(T10=1,IF(H10>0,LOOKUP(H10,MENY!$N$2:O19,MENY!$O$2:$O$18),IF(C10>0,IF(B10=\"Lør\",\"-\",\"Ordinær\"),\"-\")),\"Søndag\"))","v":"-"},null,{"$f":"IF(H10=12,IF(N10>=4,4,N10),0)","v":0},{"$f":"IF(H10=12,IF(N10>K10,N10-4,0),0)","v":0},null,{"$f":"IF(H10=11,0,IF(T10=1,IF(H10=4,((F10-C10)-(E10-D10))*24,IF(C10>0,(F10-C10-(E10-D10)-G10-AI10)*24,0)),0))","v":0},{"$f":"IF(F10>0,G10*24+N10,\"\")","v":""},null,null,{"$f":"IF(O10=\"\",\"\",\"Husk, fordel timer til prosjekter\")","v":""},null,{"$f":"IF(WEEKDAY(A10-1)<7,1,0)","v":1},{"$f":"IF(B10=\"Lør\",\"\",IF(T10=1,IF(H10=1,AH10,0),0))","v":"00:00:00"},0,{"$f":"IF(T10=1,IF(H10=3,AH10,0),0)","v":"00:00:00"},{"$f":"IF(B10=\"lør\",\"\",IF(T10=1,IF(H10=6,AH10,0),0))","v":"00:00:00"},{"$f":"IF(B10=\"Lør\",\"\",IF(T10=1,IF(H10=7,AH10,0),0))","v":"00:00:00"},{"$f":"IF(AJ10>0,IF(C10>0,    (AH10*AJ10)/(1-AJ10),0),           IF(B10=\"Lør\",\"\",IF(T10=1,IF(H10=8,AH10,0),0)))","v":"00:00:00"},{"$f":"IF(B10=\"Lør\",\"\",IF(T10=1,IF(H10=9,AH10,0),0))","v":"00:00:00"},{"$f":"IF(B10=\"Lør\",\"\",IF(T10=1,IF(H10=10,AH10,0),0))","v":"00:00:00"},0,0,0,0,0,{"$f":"((IF(A10<$F$5+1,IF(A10>$E$5-1,$G$5,$N$5),$N$5))*(1-AJ10))*(AK10)","v":"07:30:00"},{"$f":"IF(A10<$F$5+1,IF(A10>$E$5-1,$I$5,$M$5),$M$5)","v":"00:00:00"},{"$f":"AJ9","v":0},{"$f":"AK9","v":1}]
[{"$f":"A10+1","v":"2019-04-03"},{"$f":"IF(WEEKDAY(A12,2)=1,WEEKNUM(A11)*-1-MENY!$I$12,IF(WEEKDAY(A11,2)<7,LOOKUP(WEEKDAY(A11,2),MENY!$P$8:$P$14,MENY!$Q$8:$Q$14),\"\"))","v":"Ons"},null,null,null,null,{"$f":"IF(H11=11,F11-C11-(E11-D11),IF(B11=\"Lør\",0,IF(H11=4,0,IF(H11=3,IF(T11>0,W11,\"\"),IF(H11=1,0, IF(C11>0,  AH11,       \"\"))))))","v":""},0,{"$f":"IF(H11=11,\"Ordinær +\",IF(T11=1,IF(H11>0,LOOKUP(H11,MENY!$N$2:O20,MENY!$O$2:$O$18),IF(C11>0,IF(B11=\"Lør\",\"-\",\"Ordinær\"),\"-\")),\"Søndag\"))","v":"-"},null,0,0,null,0,"",null,null,"",null,1,"00:00:00",0,"00:00:00","00:00:00","00:00:00","00:00:00","00:00:00","00:00:00",0,0,0,0,0,"07:30:00","00:00:00",{"$f":"AJ10","v":0},{"$f":"AK10","v":1}]
["2019-04-04",{"$f":"IF(WEEKDAY(A13,2)=1,WEEKNUM(A12)*-1-MENY!$I$12,IF(WEEKDAY(A12,2)<7,LOOKUP(WEEKDAY(A12,2),MENY!$P$8:$P$14,MENY!$Q$8:$Q$14),\"\"))","v":"Tors"},null,null,null,null,"",0,{"$f":"IF(H12=11,\"Ordinær +\",IF(T12=1,IF(H12>0,LOOKUP(H12,MENY!$N$2:O21,MENY!$O$2:$O$18),IF(C12>0,IF(B12=\"Lør\",\"-\",\"Ordinær\"),\"-\")),\"Søndag\"))","v":"-"},null,0,0,null,0,"",null,null,"",null,1,"00:00:00",0,"00:00:00","00:00:00","00:00:00","00:00:00","00:00:00","00:00:00",0,0,0,0,0,"07:30:00","00:00:00",0,1]
["2019-04-05",{"$f":"IF(WEEKDAY(A14,2)=1,WEEKNUM(A13)*-1-MENY!$I$12,IF(WEEKDAY(A13,2)<7,LOOKUP(WEEKDAY(A13,2),MENY!$P$8:$P$14,MENY!$Q$8:$Q$14),\"\"))","v":"Fre"},null,null,null,null,"",0,{"$f":"IF(H13=11,\"Ordinær +\",IF(T13=1,IF(H13>0,LOOKUP(H13,MENY!$N$2:O22,MENY!$O$2:$O$18),IF(C13>0,IF(B13=\"Lør\",\"-\",\"Ordinær\"),\"-\")),\"Søndag\"))","v":"-"},null,0,0,null,0,"",null,null,"",null,1,"00:00:00",0,"00:00:00","00:00:00","00:00:00","00:00:00","00:00:00","00:00:00",0,0,0,0,0,"07:30:00","00:00:00",0,1]
["2019-04-06",{"$f":"IF(WEEKDAY(A15,2)=1,WEEKNUM(A14)*-1-MENY!$I$12,IF(WEEKDAY(A14,2)<7,LOOKUP(WEEKDAY(A14,2),MENY!$P$8:$P$14,MENY!$Q$8:$Q$14),\"\"))","v":"Lør"},null,null,null,null,"00:00:00",0,{"$f":"IF(H14=11,\"Ordinær +\",IF(T14=1,IF(H14>0,LOOKUP(H14,MENY!$N$2:O23,MENY!$O$2:$O$18),IF(C14>0,IF(B14=\"Lør\",\"-\",\"Ordinær\"),\"-\")),\"Søndag\"))","v":"-"},null,0,0,null,0,"",null,null,"",null,1,"","","00:00:00","","","","","",0,0,0,0,0,"07:30:00","00:00:00",0,1]
["2019-04-07",{"$f":"IF(WEEKDAY(A16,2)=1,WEEKNUM(A15)*-1-MENY!$I$12,IF(WEEKDAY(A15,2)<7,LOOKUP(WEEKDAY(A15,2),MENY!$P$8:$P$14,MENY!$Q$8:$Q$14),\"\"))","v":-15},null,null,null,null,"",0,{"$f":"IF(H15=11,\"Ordinær +\",IF(T15=1,IF(H15>0,LOOKUP(H15,MENY!$N$2:O24,MENY!$O$2:$O$18),IF(C15>0,IF(B15=\"Lør\",\"-\",\"Ordinær\"),\"-\")),\"Søndag\"))","v":"Søndag"},null,0,0,null,0,"",null,null,"",null,0,"00:00:00","","00:00:00","00:00:00","00:00:00","00:00:00","00:00:00","00:00:00",0,0,0,0,0,"07:30:00","00:00:00",0,1]
["2019-04-08",{"$f":"IF(WEEKDAY(A17,2)=1,WEEKNUM(A16)*-1-MENY!$I$12,IF(WEEKDAY(A16,2)<7,LOOKUP(WEEKDAY(A16,2),MENY!$P$8:$P$14,MENY!$Q$8:$Q$14),\"\"))","v":"Man"},null,null,null,null,"",0,{"$f":"IF(H16=11,\"Ordinær +\",IF(T16=1,IF(H16>0,LOOKUP(H16,MENY!$N$2:O25,MENY!$O$2:$O$18),IF(C16>0,IF(B16=\"Lør\",\"-\",\"Ordinær\"),\"-\")),\"Søndag\"))","v":"-"},null,0,0,null,0,"",null,null,"",null,1,"00:00:00",0,"00:00:00","00:00:00","00:00:00","00:00:00","00:00:00","00:00:00",0,0,0,0,0,"07:30:00","00:00:00",0,1]
["2019-04-09",{"$f":"IF(WEEKDAY(A18,2)=1,WEEKNUM(A17)*-1-MENY!$I$12,IF(WEEKDAY(A17,2)<7,LOOKUP(WEEKDAY(A17,2),MENY!$P$8:$P$14,MENY!$Q$8:$Q$14),\"\"))","v":"Tirs"},null,null,null,null,"",0,{"$f":"IF(H17=11,\"Ordinær +\",IF(T17=1,IF(H17>0,LOOKUP(H17,MENY!$N$2:O26,MENY!$O$2:$O$18),IF(C17>0,IF(B17=\"Lør\",\"-\",\"Ordinær\"),\"-\")),\"Søndag\"))","v":"-"},null,0,0,null,0,"",null,null,"",null,1,"00:00:00",0,"00:00:00","00:00:00","00:00:00","00:00:00","00:00:00","00:00:00",0,0,0,0,0,"07:30:00","00:00:00",0,1]
["2019-04-10",{"$f":"IF(WEEKDAY(A19,2)=1,WEEKNUM(A18)*-1-MENY!$I$12,IF(WEEKDAY(A18,2)<7,LOOKUP(WEEKDAY(A18,2),MENY!$P$8:$P$14,MENY!$Q$8:$Q$14),\"\"))","v":"Ons"},null,null,null,null,"",0,{"$f":"IF(H18=11,\"Ordinær +\",IF(T18=1,IF(H18>0,LOOKUP(H18,MENY!$N$2:O27,MENY!$O$2:$O$18),IF(C18>0,IF(B18=\"Lør\",\"-\",\"Ordinær\"),\"-\")),\"Søndag\"))","v":"-"},null,0,0,null,0,"",null,null,"",null,1,"00:00:00",0,"00:00:00","00:00:00","00:00:00","00:00:00","00:00:00","00:00:00",0,0,0,0,0,"07:30:00","00:00:00",0,1]
["2019-04-11",{"$f":"IF(WEEKDAY(A20,2)=1,WEEKNUM(A19)*-1-MENY!$I$12,IF(WEEKDAY(A19,2)<7,LOOKUP(WEEKDAY(A19,2),MENY!$P$8:$P$14,MENY!$Q$8:$Q$14),\"\"))","v":"Tors"},null,null,null,null,"",0,{"$f":"IF(H19=11,\"Ordinær +\",IF(T19=1,IF(H19>0,LOOKUP(H19,MENY!$N$2:O28,MENY!$O$2:$O$18),IF(C19>0,IF(B19=\"Lør\",\"-\",\"Ordinær\"),\"-\")),\"Søndag\"))","v":"-"},null,0,0,null,0,"",null,null,"",null,1,"00:00:00",0,"00:00:00","00:00:00","00:00:00","00:00:00","00:00:00","00:00:00",0,0,0,0,0,"07:30:00","00:00:00",0,1]
["2019-04-12",{"$f":"IF(WEEKDAY(A21,2)=1,WEEKNUM(A20)*-1-MENY!$I$12,IF(WEEKDAY(A20,2)<7,LOOKUP(WEEKDAY(A20,2),MENY!$P$8:$P$14,MENY!$Q$8:$Q$14),\"\"))","v":"Fre"},null,null,null,null,"",0,{"$f":"IF(H20=11,\"Ordinær +\",IF(T20=1,IF(H20>0,LOOKUP(H20,MENY!$N$2:O29,MENY!$O$2:$O$18),IF(C20>0,IF(B20=\"Lør\",\"-\",\"Ordinær\"),\"-\")),\"Søndag\"))","v":"-"},null,0,0,null,0,"",null,null,"",null,1,"00:00:00",0,"00:00:00","00:00:00","00:00:00","00:00:00","00:00:00","00:00:00",0,0,0,0,0,"07:30:00","00:00:00",0,1]
["2019-04-13",{"$f":"IF(WEEKDAY(A22,2)=1,WEEKNUM(A21)*-1-MENY!$I$12,IF(WEEKDAY(A21,2)<7,LOOKUP(WEEKDAY(A21,2),MENY!$P$8:$P$14,MENY!$Q$8:$Q$14),\"\"))","v":"Lør"},null,null,null,null,"00:00:00",0,{"$f":"IF(H21=11,\"Ordinær +\",IF(T21=1,IF(H21>0,LOOKUP(H21,MENY!$N$2:O30,MENY!$O$2:$O$18),IF(C21>0,IF(B21=\"Lør\",\"-\",\"Ordinær\"),\"-\")),\"Søndag\"))","v":"-"},null,0,0,null,0,"",null,null,"",null,1,"","","00:00:00","","","","","",0,0,0,0,0,"07:30:00","00:00:00",0,1]
["2019-04-14",{"$f":"IF(WEEKDAY(A23,2)=1,WEEKNUM(A22)*-1-MENY!$I$12,IF(WEEKDAY(A22,2)<7,LOOKUP(WEEKDAY(A22,2),MENY!$P$8:$P$14,MENY!$Q$8:$Q$14),\"\"))","v":-16},null,null,null,null,"",0,{"$f":"IF(H22=11,\"Ordinær +\",IF(T22=1,IF(H22>0,LOOKUP(H22,MENY!$N$2:O31,MENY!$O$2:$O$18),IF(C22>0,IF(B22=\"Lør\",\"-\",\"Ordinær\"),\"-\")),\"Søndag\"))","v":"Søndag"},null,0,0,null,0,"",null,null,"",null,0,"00:00:00","","00:00:00","00:00:00","00:00:00","00:00:00","00:00:00","00:00:00",0,0,0,0,0,"07:30:00","00:00:00",0,1]
["2019-04-15",{"$f":"IF(WEEKDAY(A24,2)=1,WEEKNUM(A23)*-1-MENY!$I$12,IF(WEEKDAY(A23,2)<7,LOOKUP(WEEKDAY(A23,2),MENY!$P$8:$P$14,MENY!$Q$8:$Q$14),\"\"))","v":"Man"},null,null,null,null,"",0,{"$f":"IF(H23=11,\"Ordinær +\",IF(T23=1,IF(H23>0,LOOKUP(H23,MENY!$N$2:O32,MENY!$O$2:$O$18),IF(C23>0,IF(B23=\"Lør\",\"-\",\"Ordinær\"),\"-\")),\"Søndag\"))","v":"-"},null,0,0,null,0,"",null,null,"",null,1,"00:00:00",0,"00:00:00","00:00:00","00:00:00","00:00:00","00:00:00","00:00:00",0,0,0,0,0,"07:30:00","00:00:00",0,1]
["2019-04-16",{"$f":"IF(WEEKDAY(A25,2)=1,WEEKNUM(A24)*-1-MENY!$I$12,IF(WEEKDAY(A24,2)<7,LOOKUP(WEEKDAY(A24,2),MENY!$P$8:$P$14,MENY!$Q$8:$Q$14),\"\"))","v":"Tirs"},null,null,null,null,"",0,{"$f":"IF(H24=11,\"Ordinær +\",IF(T24=1,IF(H24>0,LOOKUP(H24,MENY!$N$2:O33,MENY!$O$2:$O$18),IF(C24>0,IF(B24=\"Lør\",\"-\",\"Ordinær\"),\"-\")),\"Søndag\"))","v":"-"},null,0,0,null,0,"",null,null,"",null,1,"00:00:00",0,"00:00:00","00:00:00","00:00:00","00:00:00","00:00:00","00:00:00",0,0,0,0,0,"07:30:00","00:00:00",0,1]
["2019-04-17",{"$f":"IF(WEEKDAY(A26,2)=1,WEEKNUM(A25)*-1-MENY!$I$12,IF(WEEKDAY(A25,2)<7,LOOKUP(WEEKDAY(A25,2),MENY!$P$8:$P$14,MENY!$Q$8:$Q$14),\"\"))","v":"Ons"},null,null,null,null,"",0,{"$f":"IF(H25=11,\"Ordinær +\",IF(T25=1,IF(H25>0,LOOKUP(H25,MENY!$N$2:O34,MENY!$O$2:$O$18),IF(C25>0,IF(B25=\"Lør\",\"-\",\"Ordinær\"),\"-\")),\"Søndag\"))","v":"-"},null,0,0,null,0,"",null,null,"",null,1,"00:00:00",0,"00:00:00","00:00:00","00:00:00","00:00:00","00:00:00","00:00:00",0,0,0,0,0,"07:30:00","00:00:00",0,1]
["2019-04-18",{"$f":"IF(WEEKDAY(A27,2)=1,WEEKNUM(A26)*-1-MENY!$I$12,IF(WEEKDAY(A26,2)<7,LOOKUP(WEEKDAY(A26,2),MENY!$P$8:$P$14,MENY!$Q$8:$Q$14),\"\"))","v":"Tors"},null,null,null,null,"",0,{"$f":"IF(H26=11,\"Ordinær +\",IF(T26=1,IF(H26>0,LOOKUP(H26,MENY!$N$2:O35,MENY!$O$2:$O$18),IF(C26>0,IF(B26=\"Lør\",\"-\",\"Ordinær\"),\"-\")),\"Søndag\"))","v":"-"},null,0,0,null,0,"",null,null,"",null,1,"00:00:00",0,"00:00:00","00:00:00","00:00:00","00:00:00","00:00:00","00:00:00",0,0,0,0,0,"07:30:00","00:00:00",0,1]
["2019-04-19",{"$f":"IF(WEEKDAY(A28,2)=1,WEEKNUM(A27)*-1-MENY!$I$12,IF(WEEKDAY(A27,2)<7,LOOKUP(WEEKDAY(A27,2),MENY!$P$8:$P$14,MENY!$Q$8:$Q$14),\"\"))","v":"Fre"},null,null,null,null,"",0,{"$f":"IF(H27=11,\"Ordinær +\",IF(T27=1,IF(H27>0,LOOKUP(H27,MENY!$N$2:O36,MENY!$O$2:$O$18),IF(C27>0,IF(B27=\"Lør\",\"-\",\"Ordinær\"),\"-\")),\"Søndag\"))","v":"-"},null,0,0,null,0,"",null,null,"",null,1,"00:00:00",0,"00:00:00","00:00:00","00:00:00","00:00:00","00:00:00","00:00:00",0,0,0,0,0,"07:30:00","00:00:00",0,1]
["2019-04-20",{"$f":"IF(WEEKDAY(A29,2)=1,WEEKNUM(A28)*-1-MENY!$I$12,IF(WEEKDAY(A28,2)<7,LOOKUP(WEEKDAY(A28,2),MENY!$P$8:$P$14,MENY!$Q$8:$Q$14),\"\"))","v":"Lør"},null,null,null,null,"00:00:00",0,{"$f":"IF(H28=11,\"Ordinær +\",IF(T28=1,IF(H28>0,LOOKUP(H28,MENY!$N$2:O37,MENY!$O$2:$O$18),IF(C28>0,IF(B28=\"Lør\",\"-\",\"Ordinær\"),\"-\")),\"Søndag\"))","v":"-"},null,0,0,null,0,"",null,null,"",null,1,"","","00:00:00","","","","","",0,0,0,0,0,"07:30:00","00:00:00",0,1]
["2019-04-21",{"$f":"IF(WEEKDAY(A30,2)=1,WEEKNUM(A29)*-1-MENY!$I$12,IF(WEEKDAY(A29,2)<7,LOOKUP(WEEKDAY(A29,2),MENY!$P$8:$P$14,MENY!$Q$8:$Q$14),\"\"))","v":-17},null,null,null,null,"",0,{"$f":"IF(H29=11,\"Ordinær +\",IF(T29=1,IF(H29>0,LOOKUP(H29,MENY!$N$2:O38,MENY!$O$2:$O$18),IF(C29>0,IF(B29=\"Lør\",\"-\",\"Ordinær\"),\"-\")),\"Søndag\"))","v":"Søndag"},null,0,0,null,0,"",null,null,"",null,0,"00:00:00","","00:00:00","00:00:00","00:00:00","00:00:00","00:00:00","00:00:00",0,0,0,0,0,"07:30:00","00:00:00",0,1]
["2019-04-22",{"$f":"IF(WEEKDAY(A31,2)=1,WEEKNUM(A30)*-1-MENY!$I$12,IF(WEEKDAY(A30,2)<7,LOOKUP(WEEKDAY(A30,2),MENY!$P$8:$P$14,MENY!$Q$8:$Q$14),\"\"))","v":"Man"},null,null,null,null,"",0,{"$f":"IF(H30=11,\"Ordinær +\",IF(T30=1,IF(H30>0,LOOKUP(H30,MENY!$N$2:O39,MENY!$O$2:$O$18),IF(C30>0,IF(B30=\"Lør\",\"-\",\"Ordinær\"),\"-\")),\"Søndag\"))","v":"-"},null,0,0,null,0,"",null,null,"",null,1,"00:00:00",0,"00:00:00","00:00:00","00:00:00","00:00:00","00:00:00","00:00:00",0,0,0,0,0,"07:30:00","00:00:00",0,1]
["2019-04-23",{"$f":"IF(WEEKDAY(A32,2)=1,WEEKNUM(A31)*-1-MENY!$I$12,IF(WEEKDAY(A31,2)<7,LOOKUP(WEEKDAY(A31,2),MENY!$P$8:$P$14,MENY!$Q$8:$Q$14),\"\"))","v":"Tirs"},null,null,null,null,"",0,{"$f":"IF(H31=11,\"Ordinær +\",IF(T31=1,IF(H31>0,LOOKUP(H31,MENY!$N$2:O40,MENY!$O$2:$O$18),IF(C31>0,IF(B31=\"Lør\",\"-\",\"Ordinær\"),\"-\")),\"Søndag\"))","v":"-"},null,0,0,null,0,"",null,null,"",null,1,"00:00:00",0,"00:00:00","00:00:00","00:00:00","00:00:00","00:00:00","00:00:00",0,0,0,0,0,"07:30:00","00:00:00",0,1]
["2019-04-24",{"$f":"IF(WEEKDAY(A33,2)=1,WEEKNUM(A32)*-1-MENY!$I$12,IF(WEEKDAY(A32,2)<7,LOOKUP(WEEKDAY(A32,2),MENY!$P$8:$P$14,MENY!$Q$8:$Q$14),\"\"))","v":"Ons"},null,null,null,null,"",0,{"$f":"IF(H32=11,\"Ordinær +\",IF(T32=1,IF(H32>0,LOOKUP(H32,MENY!$N$2:O41,MENY!$O$2:$O$18),IF(C32>0,IF(B32=\"Lør\",\"-\",\"Ordinær\"),\"-\")),\"Søndag\"))","v":"-"},null,0,0,null,0,"",null,null,"",null,1,"00:00:00",0,"00:00:00","00:00:00","00:00:00","00:00:00","00:00:00","00:00:00",0,0,0,0,0,"07:30:00","00:00:00",0,1]
["2019-04-25",{"$f":"IF(WEEKDAY(A34,2)=1,WEEKNUM(A33)*-1-MENY!$I$12,IF(WEEKDAY(A33,2)<7,LOOKUP(WEEKDAY(A33,2),MENY!$P$8:$P$14,MENY!$Q$8:$Q$14),\"\"))","v":"Tors"},null,null,null,null,"",0,{"$f":"IF(H33=11,\"Ordinær +\",IF(T33=1,IF(H33>0,LOOKUP(H33,MENY!$N$2:O42,MENY!$O$2:$O$18),IF(C33>0,IF(B33=\"Lør\",\"-\",\"Ordinær\"),\"-\")),\"Søndag\"))","v":"-"},null,0,0,null,0,"",null,null,"",null,1,"00:00:00",0,"00:00:00","00:00:00","00:00:00","00:00:00","00:00:00","00:00:00",0,0,0,0,0,"07:30:00","00:00:00",0,1]
["2019-04-26",{"$f":"IF(WEEKDAY(A35,2)=1,WEEKNUM(A34)*-1-MENY!$I$12,IF(WEEKDAY(A34,2)<7,LOOKUP(WEEKDAY(A34,2),MENY!$P$8:$P$14,MENY!$Q$8:$Q$14),\"\"))","v":"Fre"},null,null,null,null,"",0,{"$f":"IF(H34=11,\"Ordinær +\",IF(T34=1,IF(H34>0,LOOKUP(H34,MENY!$N$2:O43,MENY!$O$2:$O$18),IF(C34>0,IF(B34=\"Lør\",\"-\",\"Ordinær\"),\"-\")),\"Søndag\"))","v":"-"},null,0,0,null,0,"",null,null,"",null,1,"00:00:00",0,"00:00:00","00:00:00","00:00:00","00:00:00","00:00:00","00:00:00",0,0,0,0,0,"07:30:00","00:00:00",0,1]
["2019-04-27",{"$f":"IF(WEEKDAY(A36,2)=1,WEEKNUM(A35)*-1-MENY!$I$12,IF(WEEKDAY(A35,2)<7,LOOKUP(WEEKDAY(A35,2),MENY!$P$8:$P$14,MENY!$Q$8:$Q$14),\"\"))","v":"Lør"},null,null,null,null,"00:00:00",0,{"$f":"IF(H35=11,\"Ordinær +\",IF(T35=1,IF(H35>0,LOOKUP(H35,MENY!$N$2:O44,MENY!$O$2:$O$18),IF(C35>0,IF(B35=\"Lør\",\"-\",\"Ordinær\"),\"-\")),\"Søndag\"))","v":"-"},null,0,0,null,0,"",null,null,"",null,{"$f":"IF(A35>0,IF(WEEKDAY(A35-1)<7,1,0),\"\")","v":1},"","","00:00:00","","","","","",0,0,0,0,0,"07:30:00","00:00:00",0,1]
["2019-04-28",{"$f":"IF(WEEKDAY(A37,2)=1,WEEKNUM(A36)*-1-MENY!$I$12,IF(WEEKDAY(A36,2)<7,LOOKUP(WEEKDAY(A36,2),MENY!$P$8:$P$14,MENY!$Q$8:$Q$14),\"\"))","v":-18},null,null,null,null,"",0,{"$f":"IF(H36=11,\"Ordinær +\",IF(T36=1,IF(H36>0,LOOKUP(H36,MENY!$N$2:O45,MENY!$O$2:$O$18),IF(C36>0,IF(B36=\"Lør\",\"-\",\"Ordinær\"),\"-\")),\"Søndag\"))","v":"Søndag"},null,0,0,null,0,"",null,null,"",null,{"$f":"IF(A36>0,IF(WEEKDAY(A36-1)<7,1,0),\"\")","v":0},"00:00:00","","00:00:00","00:00:00","00:00:00","00:00:00","00:00:00","00:00:00",0,0,0,0,0,"07:30:00","00:00:00",0,1]
["2019-04-29",{"$f":"IF(WEEKDAY(A38,2)=1,WEEKNUM(A37)*-1-MENY!$I$12,IF(WEEKDAY(A37,2)<7,LOOKUP(WEEKDAY(A37,2),MENY!$P$8:$P$14,MENY!$Q$8:$Q$14),\"\"))","v":"Man"},null,null,null,null,"",0,{"$f":"IF(H37=11,\"Ordinær +\",IF(T37=1,IF(H37>0,LOOKUP(H37,MENY!$N$2:O46,MENY!$O$2:$O$18),IF(C37>0,IF(B37=\"Lør\",\"-\",\"Ordinær\"),\"-\")),\"Søndag\"))","v":"-"},null,0,0,null,0,"",null,null,"",null,{"$f":"IF(A37>0,IF(WEEKDAY(A37-1)<7,1,0),\"\")","v":1},"00:00:00",0,"00:00:00","00:00:00","00:00:00","00:00:00","00:00:00","00:00:00",0,0,0,0,0,"07:30:00","00:00:00",0,1]
["2019-04-30",{"$f":"IF(WEEKDAY(A39,2)=1,WEEKNUM(A38)*-1-MENY!$I$12,IF(WEEKDAY(A38,2)<7,LOOKUP(WEEKDAY(A38,2),MENY!$P$8:$P$14,MENY!$Q$8:$Q$14),\"\"))","v":"Tirs"},null,null,null,null,"",0,{"$f":"IF(H38=11,\"Ordinær +\",IF(T38=1,IF(H38>0,LOOKUP(H38,MENY!$N$2:O47,MENY!$O$2:$O$18),IF(C38>0,IF(B38=\"Lør\",\"-\",\"Ordinær\"),\"-\")),\"Søndag\"))","v":"-"},null,0,0,null,0,"",null,null,"",null,{"$f":"IF(A38>0,IF(WEEKDAY(A38-1)<7,1,0),\"\")","v":1},"00:00:00",0,"00:00:00","00:00:00","00:00:00","00:00:00","00:00:00","00:00:00",0,0,0,0,0,"07:30:00","00:00:00",0,1]
[null,null,null,null,null,null,"",0,{"$f":"IF(A39>0,IF(H39=11,\"Ordinær +\",IF(T39=1,IF(H39>0,LOOKUP(H39,MENY!$N$2:O48,MENY!$O$2:$O$18),IF(C39>0,IF(B39=\"Lør\",\"-\",\"Ordinær\"),\"-\")),\"Søndag\")),\"-\")","v":"-"},null,0,0,null,0,"",null,null,"",null,{"$f":"IF(A39>0,IF(WEEKDAY(A39-1)<7,1,0),\"\")","v":""},"00:00:00","","00:00:00","00:00:00","00:00:00","00:00:00",{"$f":"IF(B39=\"Lør\",\"\",IF(T39=1,IF(H39=9,AH39,0),0))","v":"00:00:00"},"00:00:00",0,0,0,0,0,"07:30:00","00:00:00",0,1]
[null,null,null,"Sum for denne måned",null,null,{"$f":"SUM(G9:G39)*24","v":0},null,null,null,{"$f":"SUM(K9:K39)+N49","v":0},{"$f":"SUM(L9:L39)","v":0},{"$f":"SUM(M9:M39)","v":0},{"$f":"SUM(N9:N39)-U40-AG41-SUM(K40:M40)+N50","v":0},{"$f":"SUM(O9:O39)","v":0},"Fravær denne måned",null,null,null,null,{"$f":"SUM(U9:U39)*24","v":0},{"$f":"SUM(V9:V39)","v":0},{"$f":"SUM(W9:W39)*24","v":0},0,0,0,0,0,{"$f":"SUM(AC9:AC39)","v":0},{"$f":"SUM(AD9:AD39)","v":0},{"$f":"SUM(AE9:AE39)","v":0},{"$f":"SUM(AF9:AF39)","v":0},{"$f":"SUM(AG9:AG39)","v":0}]
[null,null,null,"Overført fra forrige måned",null,null,null,null,null,null,null,null,null,{"$f":"MAR!N47","v":0},{"$f":"MAR!O42","v":0},"Type","Timer",null,null,null,null,null,null,null,null,null,null,null,null,null,null,"Sum deltidsfravær:",{"$f":"SUM(AC40:AG40)","v":0}]
[null,null,null,"Sum hittil i år",null,null,null,null,null,null,null,null,null,{"$f":"SUM(N40:N41)","v":0},{"$f":"SUM(O40:O41)","v":0},"06 Perm m/lønn",{"$f":"X40+AC40*-1","v":0}]
["Ferieregnskap",null,null,"Dager","Timeregnskap",null,null,null,null,null,null,null,null,"Timer",null,"07 Perm u/lønn",{"$f":"Y40+AD40*-1","v":0}]
["Disponible feriedager",null,null,{"$f":"MAR!D47","v":25},"Opptjent denne måneden",null,null,null,null,null,null,null,null,{"$f":"SUM(N9:N39)-AG41-(SUM(K40:M40))+N50","v":0},null,"08 Sykemelding",{"$f":"(Z40+AE40*-1)","v":0}]
["Brukt denne måned",null,null,{"$f":"V40*-1","v":0},"Avspasert denne måneden",null,null,null,null,null,null,null,null,{"$f":"U40","v":0},null,"09 Egenmelding",{"$f":"(AA40+AF40*-1)","v":0}]
["Endring i feriedager",null,null,null,"Utbetalt overtid denne måned",null,null,null,null,null,null,null,null,{"$f":"SUM(K40:M40)","v":0},null,"10 Sykt barn",{"$f":"(AB40+AG40*-1)","v":0}]
["Til gode",null,null,{"$f":"SUM(D44:D46)","v":25},"Til gode for avspasering",null,null,null,null,null,null,null,null,{"$f":"N42","v":0},null,"Sum - April",{"$f":"SUM(Q42:Q46)","v":0}]
[null,null,null,null,"Effektiv arbeidstid denne måned",null,null,null,null,null,null,null,null,{"$f":"G40+N44+AG41+N46-N50","v":0},null,"Hittil i år",{"$f":"Q47+MAR!Q48","v":0}]
[null,null,null,null,"Flexitid omgjort til overtid og utbetalt, denne måned"]
[null,null,null,null,"Annen korrigering av flexitid, OBS! skriv egen merknad"]
["Merknader"]
[]
[]
[]
[]
[]
["Overtid for utbetaling:",null,null,null,null,null,"Dato",null,null,null,null,null,null,null,"Dato"]
[null,null,null,"Timer med 50% tillegg :",{"$f":"K40","v":0}]
[null,null,null,"Timer med 100% tillegg:",{"$f":"L40","v":0}]
[null,null,null,"Timer med 133% tillegg:",{"$f":"M39","v":0},null,null,null,"Attestert",null,null,null,null,null,"Anvist"]
[]
[]
[null,null,null,null,null,null,null,null,null,null,null,null,null,null,null,{"$f":"MENY!D6","v":"Leder"}]
["© Ole Jørgen Klaussen - 2003",null,null,null,{"$f":"TODAY()","v":"2018-11-30"},{"$f":"YEAR(TODAY())","v":2018},null,null,null,null,null,null,null,null,null,null,"ole.klaussen@online.no"]

{"sheet":"MAI","index":5,"n_rows":64,"n_cols":37,"rows_kept":64,"cut":false,"hidden":false,"merged":[[5,19,5,22],[13,15,13,16],[14,15,14,16],[18,15,18,16],[15,15,15,16],[16,15,16,16],[17,15,17,16],[2,1,2,6],[6,3,6,4],[7,7,7,8],[5,7,6,16],[19,15,19,16],[2,15,2,16],[34,15,34,16],[35,15,35,16],[36,15,36,16],[37,15,37,16],[30,15,30,16],[31,15,31,16],[24,15,24,16],[25,15,25,16],[23,15,23,16],[27,15,27,16],[20,15,20,16],[21,15,21,16],[22,15,22,16],[38,15,38,16],[1,28,2,33],[59,14,59,16],[62,6,62,10],[55,0,55,16],[56,6,56,10],[56,14,56,16],[51,0,51,16],[52,0,52,16],[53,0,53,16],[54,0,54,16],[32,15,32,16],[33,15,33,16],[7,15,7,16],[28,15,28,16],[29,15,29,16],[26,15,26,16]]}
["Meny","JAN","FEB","MAR","APR","MAI","JUN",null,null,null,null,null,null,null,null,null,"Hjelp","Viktig når det gjelder overtid"]
["Året","JUL","AUG","SEP","OKT","NOV","DES",null,null,null,null,null,null,null,null,"Dato",null,"For at føringer av aktiv arbeidstid skal bli riktig"]
[null,{"$f":"MENY!D4","v":"Min bedrift"},null,null,null,null,null,null,"Mai -",null,null,null,null,{"$f":"MENY!P1","v":2019},null,{"$f":"TODAY()","v":"2018-11-30"},null,"er det nødvendig at all arbeidstid registreres."]
[null,"Timeliste","Navn:",{"$f":"MENY!D5","v":"Min timeliste"},null,null,"Sommer",null,null,null,"Stillingsbrøk:",{"$f":"MENY!I5","v":1},null,"Vinter",null,null,null,"Dette gjelder også overtid. Så registrer  når du ",null,null,null,null,null,null,null,null,null,null,null,null,null,null,null,null,null,"MERK!"]
[null,null,"Sommerlukking fra/til:",null,{"$f":"MENY!Q18","v":"2019-05-15"},{"$f":"MENY!Q19","v":"2019-09-14"},{"$f":"(MENY!F13-MENY!E13-MENY!I13)*MENY!I5","v":"07:30:00"},null,{"$f":"MENY!I13","v":"00:00:00"},"  <-arbeidstid->",null,null,{"$f":"MENY!I14","v":"00:00:00"},{"$f":"(MENY!F14-MENY!E14-MENY!I14)*MENY!I5","v":"07:30:00"},null,null,null,"kommer på jobb (inn) og når du er ferdig (ut)",null,null,null,null,null,null,null,null,null,null,null,null,null,null,null,null,null,"Les her"]
["År ",null,null,null,null,null,null,"Fyll ut i arbeids og fraværskode : 0=ordinær  1=Avspasere  2=Ferie  3=Tjeneste  4=Plussdag  5=Helligdag  6=Perm M/lønn  7=Perm U/lønn  8=Sykemelding  9=Egenmelding 10=Sykt barn 11=Ordinær+ , 12 = plusstid som overtid",null,null,null,null,null,null,null,null,null,"Dersom noe av tiden skal utbetales i overtid, så",null,"Arbeidsdata",null,null,null,null,null,null,null,null,6,7,8,9,10,null,null,"Syke-","Stillings"]
[{"$f":"N3","v":2019},{"$f":"WEEKNUM(A9)+MENY!I12","v":18},"I dag","Fravær pr dag",null,"I dag",null,null,null,null,null,null,null,null,null,null,null,"legg inn antall timer nederst på arket.",null,null,null,null,null,6,7,8,9,10,12,13,14,15,16,null,null,"melding","brøk"]
["DATO","UKENR                               og DAG","Inn","Ut","Inn","Ut","Ordinær","Arbeids og fraværskode",null,"Fravær",0.5,1,1.33,"Balanse","Timer i dag","Merknad ",null,"Huskeliste",null,"Arbeids dag","Avsp","Ferie","Tjeneste","Perm m-lønn","Perm u-lønn","Sykemelding","Egenmelding","Sykt barn","Perm m-lønn","Perm u-lønn","Sykemelding","Egenmelding","Sykt barn","Ordinær arbeidstid","Trekk for matpause","i prosent andel"]
[{"$f":"DATE(MENY!P1,5,1)","v":"2019-05-01"},{"$f":"IF(WEEKDAY(A10,2)=1,WEEKNUM(A9)*-1-MENY!$I$12,IF(WEEKDAY(A9,2)<7,LOOKUP(WEEKDAY(A9,2),MENY!$P$8:$P$14,MENY!$Q$8:$Q$14),\"\"))","v":"Ons"},null,null,null,null,{"$f":"IF(H9=11,F9-C9-(E9-D9),IF(B9=\"Lør\",0,IF(H9=4,0,IF(H9=3,IF(T9>0,W9,\"\"),IF(H9=1,0, IF(C9>0,  AH9,       \"\"))))))","v":""},{"$f":"IF(B9=\"Lør\",IF(C9>0,4,0),0)","v":0},{"$f":"IF(H9=11,\"Ordinær +\",IF(T9=1,IF(H9>0,LOOKUP(H9,MENY!$N$2:O18,MENY!$O$2:$O$18),IF(C9>0,IF(B9=\"Lør\",\"-\",\"Ordinær\"),\"-\")),\"Søndag\"))","v":"-"},null,{"$f":"IF(H9=12,IF(N9>=4,4,N9),0)","v":0},{"$f":"IF(H9=12,IF(N9>K9,N9-4,0),0)","v":0},null,{"$f":"IF(H9=11,0,IF(T9=1,IF(H9=4,((F9-C9)-(E9-D9))*24,IF(C9>0,(F9-C9-(E9-D9)-G9-AI9)*24,0)),0))","v":0},{"$f":"IF(F9>0,G9*24+N9,\"\")","v":""},null,null,{"$f":"IF(O9=\"\",\"\",\"Husk, fordel timer til prosjekter\")","v":""},null,{"$f":"IF(WEEKDAY(A9-1)<7,1,0)","v":1},{"$f":"IF(B9=\"Lør\",\"\",IF(T9=1,IF(H9=1,AH9,0),0))","v":"00:00:00"},{"$f":"IF(T9=1,IF(B9=\"lør\",\"\",IF(H9=2,1,0)),\"\")","v":0},{"$f":"IF(T9=1,IF(H9=3,AH9,0),0)","v":"00:00:00"},{"$f":"IF(B9=\"lør\",\"\",IF(T9=1,IF(H9=6,AH9,0),0))","v":"00:00:00"},{"$f":"IF(B9=\"Lør\",\"\",IF(T9=1,IF(H9=7,AH9,0),0))","v":"00:00:00"},{"$f":"IF(AJ9>0,IF(C9>0,    (AH9*AJ9)/(1-AJ9),0),           IF(B9=\"Lør\",\"\",IF(T9=1,IF(H9=8,AH9,0),0)))","v":"00:00:00"},{"$f":"IF(B9=\"Lør\",\"\",IF(T9=1,IF(H9=9,AH9,0),0))","v":"00:00:00"},{"$f":"IF(B9=\"Lør\",\"\",IF(T9=1,IF(H9=10,AH9,0),0))","v":"00:00:00"},{"$f":"IF(J9=6,N9,0)","v":0},{"$f":"IF(J9=7,N9,0)","v":0},{"$f":"IF(J9=8,N9,0)","v":0},{"$f":"IF(J9=9,N9,0)","v":0},{"$f":"IF(J9=10,N9,0)","v":0},{"$f":"((IF(A9<$F$5+1,IF(A9>$E$5-1,$G$5,$N$5),$N$5))*(1-AJ9))*(AK9)","v":"07:30:00"},{"$f":"IF(A9<$F$5+1,IF(A9>$E$5-1,$I$5,$M$5),$M$5)","v":"00:00:00"},{"$f":"APR!AJ39","v":0},{"$f":"APR!AK39","v":1}]
[{"$f":"A9+1","v":"2019-05-02"},{"$f":"IF(WEEKDAY(A11,2)=1,WEEKNUM(A10)*-1-MENY!$I$12,IF(WEEKDAY(A10,2)<7,LOOKUP(WEEKDAY(A10,2),MENY!$P$8:$P$14,MENY!$Q$8:$Q$14),\"\"))","v":"Tors"},null,null,null,null,{"$f":"IF(H10=11,F10-C10-(E10-D10),IF(B10=\"Lør\",0,IF(H10=4,0,IF(H10=3,IF(T10>0,W10,\"\"),IF(H10=1,0, IF(C10>0,  AH10,       \"\"))))))","v":""},0,{"$f":"IF(H10=11,\"Ordinær +\",IF(T10=1,IF(H10>0,LOOKUP(H10,MENY!$N$2:O19,MENY!$O$2:$O$18),IF(C10>0,IF(B10=\"Lør\",\"-\",\"Ordinær\"),\"-\")),\"Søndag\"))","v":"-"},null,{"$f":"IF(H10=12,IF(N10>=4,4,N10),0)","v":0},{"$f":"IF(H10=12,IF(N10>K10,N10-4,0),0)","v":0},null,{"$f":"IF(H10=11,0,IF(T10=1,IF(H10=4,((F10-C10)-(E10-D10))*24,IF(C10>0,(F10-C10-(E10-D10)-G10-AI10)*24,0)),0))","v":0},{"$f":"IF(F10>0,G10*24+N10,\"\")","v":""},null,null,{"$f":"IF(O10=\"\",\"\",\"Husk, fordel timer til prosjekter\")","v":""},null,{"$f":"IF(WEEKDAY(A10-1)<7,1,0)","v":1},{"$f":"IF(B10=\"Lør\",\"\",IF(T10=1,IF(H10=1,AH10,0),0))","v":"00:00:00"},0,{"$f":"IF(T10=1,IF(H10=3,AH10,0),0)","v":"00:00:00"},{"$f":"IF(B10=\"lør\",\"\",IF(T10=1,IF(H10=6,AH10,0),0))","v":"00:00:00"},{"$f":"IF(B10=\"Lør\",\"\",IF(T10=1,IF(H10=7,AH10,0),0))","v":"00:00:00"},{"$f":"IF(AJ10>0,IF(C10>0,    (AH10*AJ10)/(1-AJ10),0),           IF(B10=\"Lør\",\"\",IF(T10=1,IF(H10=8,AH10,0),0)))","v":"00:00:00"},{"$f":"IF(B10=\"Lør\",\"\",IF(T10=1,IF(H10=9,AH10,0),0))","v":"00:00:00"},{"$f":"IF(B10=\"Lør\",\"\",IF(T10=1,IF(H10=10,AH10,0),0))","v":"00:00:00"},0,0,0,0,0,{"$f":"((IF(A10<$F$5+1,IF(A10>$E$5-1,$G$5,$N$5),$N$5))*(1-AJ10))*(AK10)","v":"07:30:00"},{"$f":"IF(A10<$F$5+1,IF(A10>$E$5-1,$I$5,$M$5),$M$5)","v":"00:00:00"},{"$f":"AJ9","v":0},{"$f":"AK9","v":1}]
[{"$f":"A10+1","v":"2019-05-03"},{"$f":"IF(WEEKDAY(A12,2)=1,WEEKNUM(A11)*-1-MENY!$I$12,IF(WEEKDAY(A11,2)<7,LOOKUP(WEEKDAY(A11,2),MENY!$P$8:$P$14,MENY!$Q$8:$Q$14),\"\"))","v":"Fre"},null,null,null,null,{"$f":"IF(H11=11,F11-C11-(E11-D11),IF(B11=\"Lør\",0,IF(H11=4,0,IF(H11=3,IF(T11>0,W11,\"\"),IF(H11=1,0, IF(C11>0,  AH11,       \"\"))))))","v":""},0,{"$f":"IF(H11=11,\"Ordinær +\",IF(T11=1,IF(H11>0,LOOKUP(H11,MENY!$N$2:O20,MENY!$O$2:$O$18),IF(C11>0,IF(B11=\"Lør\",\"-\",\"Ordinær\"),\"-\")),\"Søndag\"))","v":"-"},null,0,0,null,0,"",null,null,"",null,1,"00:00:00",0,"00:00:00","00:00:00","00:00:00","00:00:00","00:00:00","00:00:00",0,0,0,0,0,"07:30:00","00:00:00",{"$f":"AJ10","v":0},{"$f":"AK10","v":1}]
["2019-05-04",{"$f":"IF(WEEKDAY(A13,2)=1,WEEKNUM(A12)*-1-MENY!$I$12,IF(WEEKDAY(A12,2)<7,LOOKUP(WEEKDAY(A12,2),MENY!$P$8:$P$14,MENY!$Q$8:$Q$14),\"\"))","v":"Lør"},null,null,null,null,"00:00:00",0,{"$f":"IF(H12=11,\"Ordinær +\",IF(T12=1,IF(H12>0,LOOKUP(H12,MENY!$N$2:O21,MENY!$O$2:$O$18),IF(C12>0,IF(B12=\"Lør\",\"-\",\"Ordinær\"),\"-\")),\"Søndag\"))","v":"-"},null,0,0,null,0,"",null,null,"",null,1,"","","00:00:00","","","","","",0,0,0,0,0,"07:30:00","00:00:00",0,1]
["2019-05-05",{"$f":"IF(WEEKDAY(A14,2)=1,WEEKNUM(A13)*-1-MENY!$I$12,IF(WEEKDAY(A13,2)<7,LOOKUP(WEEKDAY(A13,2),MENY!$P$8:$P$14,MENY!$Q$8:$Q$14),\"\"))","v":-19},null,null,null,null,"",0,{"$f":"IF(H13=11,\"Ordinær +\",IF(T13=1,IF(H13>0,LOOKUP(H13,MENY!$N$2:O22,MENY!$O$2:$O$18),IF(C13>0,IF(B13=\"Lør\",\"-\",\"Ordinær\"),\"-\")),\"Søndag\"))","v":"Søndag"},null,0,0,null,0,"",null,null,"",null,0,"00:00:00","","00:00:00","00:00:00","00:00:00","00:00:00","00:00:00","00:00:00",0,0,0,0,0,"07:30:00","00:00:00",0,1]
["2019-05-06",{"$f":"IF(WEEKDAY(A15,2)=1,WEEKNUM(A14)*-1-MENY!$I$12,IF(WEEKDAY(A14,2)<7,LOOKUP(WEEKDAY(A14,2),MENY!$P$8:$P$14,MENY!$Q$8:$Q$14),\"\"))","v":"Man"},null,null,null,null,"",0,{"$f":"IF(H14=11,\"Ordinær +\",IF(T14=1,IF(H14>0,LOOKUP(H14,MENY!$N$2:O23,MENY!$O$2:$O$18),IF(C14>0,IF(B14=\"Lør\",\"-\",\"Ordinær\"),\"-\")),\"Søndag\"))","v":"-"},null,0,0,null,0,"",null,null,"",null,1,"00:00:00",0,"00:00:00","00:00:00","00:00:00","00:00:00","00:00:00","00:00:00",0,0,0,0,0,"07:30:00","00:00:00",0,1]
["2019-05-07",{"$f":"IF(WEEKDAY(A16,2)=1,WEEKNUM(A15)*-1-MENY!$I$12,IF(WEEKDAY(A15,2)<7,LOOKUP(WEEKDAY(A15,2),MENY!$P$8:$P$14,MENY!$Q$8:$Q$14),\"\"))","v":"Tirs"},null,null,null,null,"",0,{"$f":"IF(H15=11,\"Ordinær +\",IF(T15=1,IF(H15>0,LOOKUP(H15,MENY!$N$2:O24,MENY!$O$2:$O$18),IF(C15>0,IF(B15=\"Lør\",\"-\",\"Ordinær\"),\"-\")),\"Søndag\"))","v":"-"},null,0,0,null,0,"",null,null,"",null,1,"00:00:00",0,"00:00:00","00:00:00","00:00:00","00:00:00","00:00:00","00:00:00",0,0,0,0,0,"07:30:00","00:00:00",0,1]
["2019-05-08",{"$f":"IF(WEEKDAY(A17,2)=1,WEEKNUM(A16)*-1-MENY!$I$12,IF(WEEKDAY(A16,2)<7,LOOKUP(WEEKDAY(A16,2),MENY!$P$8:$P$14,MENY!$Q$8:$Q$14),\"\"))","v":"Ons"},null,null,null,null,"",0,{"$f":"IF(H16=11,\"Ordinær +\",IF(T16=1,IF(H16>0,LOOKUP(H16,MENY!$N$2:O25,MENY!$O$2:$O$18),IF(C16>0,IF(B16=\"Lør\",\"-\",\"Ordinær\"),\"-\")),\"Søndag\"))","v":"-"},null,0,0,null,0,"",null,null,"",null,1,"00:00:00",0,"00:00:00","00:00:00","00:00:00","00:00:00","00:00:00","00:00:00",0,0,0,0,0,"07:30:00","00:00:00",0,1]
["2019-05-09",{"$f":"IF(WEEKDAY(A18,2)=1,WEEKNUM(A17)*-1-MENY!$I$12,IF(WEEKDAY(A17,2)<7,LOOKUP(WEEKDAY(A17,2),MENY!$P$8:$P$14,MENY!$Q$8:$Q$14),\"\"))","v":"Tors"},null,null,null,null,"",0,{"$f":"IF(H17=11,\"Ordinær +\",IF(T17=1,IF(H17>0,LOOKUP(H17,MENY!$N$2:O26,MENY!$O$2:$O$18),IF(C17>0,IF(B17=\"Lør\",\"-\",\"Ordinær\"),\"-\")),\"Søndag\"))","v":"-"},null,0,0,null,0,"",null,null,"",null,1,"00:00:00",0,"00:00:00","00:00:00","00:00:00","00:00:00","00:00:00","00:00:00",0,0,0,0,0,"07:30:00","00:00:00",0,1]
["2019-05-10",{"$f":"IF(WEEKDAY(A19,2)=1,WEEKNUM(A18)*-1-MENY!$I$12,IF(WEEKDAY(A18,2)<7,LOOKUP(WEEKDAY(A18,2),MENY!$P$8:$P$14,MENY!$Q$8:$Q$14),\"\"))","v":"Fre"},null,null,null,null,"",0,{"$f":"IF(H18=11,\"Ordinær +\",IF(T18=1,IF(H18>0,LOOKUP(H18,MENY!$N$2:O27,MENY!$O$2:$O$18),IF(C18>0,IF(B18=\"Lør\",\"-\",\"Ordinær\"),\"-\")),\"Søndag\"))","v":"-"},null,0,0,null,0,"",null,null,"",null,1,"00:00:00",0,"00:00:00","00:00:00","00:00:00","00:00:00","00:00:00","00:00:00",0,0,0,0,0,"07:30:00","00:00:00",0,1]
["2019-05-11",{"$f":"IF(WEEKDAY(A20,2)=1,WEEKNUM(A19)*-1-MENY!$I$12,IF(WEEKDAY(A19,2)<7,LOOKUP(WEEKDAY(A19,2),MENY!$P$8:$P$14,MENY!$Q$8:$Q$14),\"\"))","v":"Lør"},null,null,null,null,"00:00:00",0,{"$f":"IF(H19=11,\"Ordinær +\",IF(T19=1,IF(H19>0,LOOKUP(H19,MENY!$N$2:O28,MENY!$O$2:$O$18),IF(C19>0,IF(B19=\"Lør\",\"-\",\"Ordinær\"),\"-\")),\"Søndag\"))","v":"-"},null,0,0,null,0,"",null,null,"",null,1,"","","00:00:00","","","","","",0,0,0,0,0,"07:30:00","00:00:00",0,1]
["2019-05-12",{"$f":"IF(WEEKDAY(A21,2)=1,WEEKNUM(A20)*-1-MENY!$I$12,IF(WEEKDAY(A20,2)<7,LOOKUP(WEEKDAY(A20,2),MENY!$P$8:$P$14,MENY!$Q$8:$Q$14),\"\"))","v":-20},null,null,null,null,"",0,{"$f":"IF(H20=11,\"Ordinær +\",IF(T20=1,IF(H20>0,LOOKUP(H20,MENY!$N$2:O29,MENY!$O$2:$O$18),IF(C20>0,IF(B20=\"Lør\",\"-\",\"Ordinær\"),\"-\")),\"Søndag\"))","v":"Søndag"},null,0,0,null,0,"",null,null,"",null,0,"00:00:00","","00:00:00","00:00:00","00:00:00","00:00:00","00:00:00","00:00:00",0,0,0,0,0,"07:30:00","00:00:00",0,1]
["2019-05-13",{"$f":"IF(WEEKDAY(A22,2)=1,WEEKNUM(A21)*-1-MENY!$I$12,IF(WEEKDAY(A21,2)<7,LOOKUP(WEEKDAY(A21,2),MENY!$P$8:$P$14,MENY!$Q$8:$Q$14),\"\"))","v":"Man"},null,null,null,null,"",0,{"$f":"IF(H21=11,\"Ordinær +\",IF(T21=1,IF(H21>0,LOOKUP(H21,MENY!$N$2:O30,MENY!$O$2:$O$18),IF(C21>0,IF(B21=\"Lør\",\"-\",\"Ordinær\"),\"-\")),\"Søndag\"))","v":"-"},null,0,0,null,0,"",null,null,"",null,1,"00:00:00",0,"00:00:00","00:00:00","00:00:00","00:00:00","00:00:00","00:00:00",0,0,0,0,0,"07:30:00","00:00:00",0,1]
["2019-05-14",{"$f":"IF(WEEKDAY(A23,2)=1,WEEKNUM(A22)*-1-MENY!$I$12,IF(WEEKDAY(A22,2)<7,LOOKUP(WEEKDAY(A22,2),MENY!$P$8:$P$14,MENY!$Q$8:$Q$14),\"\"))","v":"Tirs"},null,null,null,null,"",0,{"$f":"IF(H22=11,\"Ordinær +\",IF(T22=1,IF(H22>0,LOOKUP(H22,MENY!$N$2:O31,MENY!$O$2:$O$18),IF(C22>0,IF(B22=\"Lør\",\"-\",\"Ordinær\"),\"-\")),\"Søndag\"))","v":"-"},null,0,0,null,0,"",null,null,"",null,1,"00:00:00",0,"00:00:00","00:00:00","00:00:00","00:00:00","00:00:00","00:00:00",0,0,0,0,0,"07:30:00","00:00:00",0,1]
["2019-05-15",{"$f":"IF(WEEKDAY(A24,2)=1,WEEKNUM(A23)*-1-MENY!$I$12,IF(WEEKDAY(A23,2)<7,LOOKUP(WEEKDAY(A23,2),MENY!$P$8:$P$14,MENY!$Q$8:$Q$14),\"\"))","v":"Ons"},null,null,null,null,"",0,{"$f":"IF(H23=11,\"Ordinær +\",IF(T23=1,IF(H23>0,LOOKUP(H23,MENY!$N$2:O32,MENY!$O$2:$O$18),IF(C23>0,IF(B23=\"Lør\",\"-\",\"Ordinær\"),\"-\")),\"Søndag\"))","v":"-"},null,0,0,null,0,"",null,null,"",null,1,"00:00:00",0,"00:00:00","00:00:00","00:00:00","00:00:00","00:00:00","00:00:00",0,0,0,0,0,"07:30:00","00:00:00",0,1]
["2019-05-16",{"$f":"IF(WEEKDAY(A25,2)=1,WEEKNUM(A24)*-1-MENY!$I$12,IF(WEEKDAY(A24,2)<7,LOOKUP(WEEKDAY(A24,2),MENY!$P$8:$P$14,MENY!$Q$8:$Q$14),\"\"))","v":"Tors"},null,null,null,null,"",0,{"$f":"IF(H24=11,\"Ordinær +\",IF(T24=1,IF(H24>0,LOOKUP(H24,MENY!$N$2:O33,MENY!$O$2:$O$18),IF(C24>0,IF(B24=\"Lør\",\"-\",\"Ordinær\"),\"-\")),\"Søndag\"))","v":"-"},null,0,0,null,0,"",null,null,"",null,1,"00:00:00",0,"00:00:00","00:00:00","00:00:00","00:00:00","00:00:00","00:00:00",0,0,0,0,0,"07:30:00","00:00:00",0,1]
["2019-05-17",{"$f":"IF(WEEKDAY(A26,2)=1,WEEKNUM(A25)*-1-MENY!$I$12,IF(WEEKDAY(A25,2)<7,LOOKUP(WEEKDAY(A25,2),MENY!$P$8:$P$14,MENY!$Q$8:$Q$14),\"\"))","v":"Fre"},null,null,null,null,"",0,{"$f":"IF(H25=11,\"Ordinær +\",IF(T25=1,IF(H25>0,LOOKUP(H25,MENY!$N$2:O34,MENY!$O$2:$O$18),IF(C25>0,IF(B25=\"Lør\",\"-\",\"Ordinær\"),\"-\")),\"Søndag\"))","v":"-"},null,0,0,null,0,"",null,null,"",null,1,"00:00:00",0,"00:00:00","00:00:00","00:00:00","00:00:00","00:00:00","00:00:00",0,0,0,0,0,"07:30:00","00:00:00",0,1]
["2019-05-18",{"$f":"IF(WEEKDAY(A27,2)=1,WEEKNUM(A26)*-1-MENY!$I$12,IF(WEEKDAY(A26,2)<7,LOOKUP(WEEKDAY(A26,2),MENY!$P$8:$P$14,MENY!$Q$8:$Q$14),\"\"))","v":"Lør"},null,null,null,null,"00:00:00",0,{"$f":"IF(H26=11,\"Ordinær +\",IF(T26=1,IF(H26>0,LOOKUP(H26,MENY!$N$2:O35,MENY!$O$2:$O$18),IF(C26>0,IF(B26=\"Lør\",\"-\",\"Ordinær\"),\"-\")),\"Søndag\"))","v":"-"},null,0,0,null,0,"",null,null,"",null,1,"","","00:00:00","","","","","",0,0,0,0,0,"07:30:00","00:00:00",0,1]
["2019-05-19",{"$f":"IF(WEEKDAY(A28,2)=1,WEEKNUM(A27)*-1-MENY!$I$12,IF(WEEKDAY(A27,2)<7,LOOKUP(WEEKDAY(A27,2),MENY!$P$8:$P$14,MENY!$Q$8:$Q$14),\"\"))","v":-21},null,null,null,null,"",0,{"$f":"IF(H27=11,\"Ordinær +\",IF(T27=1,IF(H27>0,LOOKUP(H27,MENY!$N$2:O36,MENY!$O$2:$O$18),IF(C27>0,IF(B27=\"Lør\",\"-\",\"Ordinær\"),\"-\")),\"Søndag\"))","v":"Søndag"},null,0,0,null,0,"",null,null,"",null,0,"00:00:00","","00:00:00","00:00:00","00:00:00","00:00:00","00:00:00","00:00:00",0,0,0,0,0,"07:30:00","00:00:00",0,1]
["2019-05-20",{"$f":"IF(WEEKDAY(A29,2)=1,WEEKNUM(A28)*-1-MENY!$I$12,IF(WEEKDAY(A28,2)<7,LOOKUP(WEEKDAY(A28,2),MENY!$P$8:$P$14,MENY!$Q$8:$Q$14),\"\"))","v":"Man"},null,null,null,null,"",0,{"$f":"IF(H28=11,\"Ordinær +\",IF(T28=1,IF(H28>0,LOOKUP(H28,MENY!$N$2:O37,MENY!$O$2:$O$18),IF(C28>0,IF(B28=\"Lør\",\"-\",\"Ordinær\"),\"-\")),\"Søndag\"))","v":"-"},null,0,0,null,0,"",null,null,"",null,1,"00:00:00",0,"00:00:00","00:00:00","00:00:00","00:00:00","00:00:00","00:00:00",0,0,0,0,0,"07:30:00","00:00:00",0,1]
["2019-05-21",{"$f":"IF(WEEKDAY(A30,2)=1,WEEKNUM(A29)*-1-MENY!$I$12,IF(WEEKDAY(A29,2)<7,LOOKUP(WEEKDAY(A29,2),MENY!$P$8:$P$14,MENY!$Q$8:$Q$14),\"\"))","v":"Tirs"},null,null,null,null,"",0,{"$f":"IF(H29=11,\"Ordinær +\",IF(T29=1,IF(H29>0,LOOKUP(H29,MENY!$N$2:O38,MENY!$O$2:$O$18),IF(C29>0,IF(B29=\"Lør\",\"-\",\"Ordinær\"),\"-\")),\"Søndag\"))","v":"-"},null,0,0,null,0,"",null,null,"",null,1,"00:00:00",0,"00:00:00","00:00:00","00:00:00","00:00:00","00:00:00","00:00:00",0,0,0,0,0,"07:30:00","00:00:00",0,1]
["2019-05-22",{"$f":"IF(WEEKDAY(A31,2)=1,WEEKNUM(A30)*-1-MENY!$I$12,IF(WEEKDAY(A30,2)<7,LOOKUP(WEEKDAY(A30,2),MENY!$P$8:$P$14,MENY!$Q$8:$Q$14),\"\"))","v":"Ons"},null,null,null,null,"",0,{"$f":"IF(H30=11,\"Ordinær +\",IF(T30=1,IF(H30>0,LOOKUP(H30,MENY!$N$2:O39,MENY!$O$2:$O$18),IF(C30>0,IF(B30=\"Lør\",\"-\",\"Ordinær\"),\"-\")),\"Søndag\"))","v":"-"},null,0,0,null,0,"",null,null,"",null,1,"00:00:00",0,"00:00:00","00:00:00","00:00:00","00:00:00","00:00:00","00:00:00",0,0,0,0,0,"07:30:00","00:00:00",0,1]
["2019-05-23",{"$f":"IF(WEEKDAY(A32,2)=1,WEEKNUM(A31)*-1-MENY!$I$12,IF(WEEKDAY(A31,2)<7,LOOKUP(WEEKDAY(A31,2),MENY!$P$8:$P$14,MENY!$Q$8:$Q$14),\"\"))","v":"Tors"},null,null,null,null,"",0,{"$f":"IF(H31=11,\"Ordinær +\",IF(T31=1,IF(H31>0,LOOKUP(H31,MENY!$N$2:O40,MENY!$O$2:$O$18),IF(C31>0,IF(B31=\"Lør\",\"-\",\"Ordinær\"),\"-\")),\"Søndag\"))","v":"-"},null,0,0,null,0,"",null,null,"",null,1,"00:00:00",0,"00:00:00","00:00:00","00:00:00","00:00:00","00:00:00","00:00:00",0,0,0,0,0,"07:30:00","00:00:00",0,1]
["2019-05-24",{"$f":"IF(WEEKDAY(A33,2)=1,WEEKNUM(A32)*-1-MENY!$I$12,IF(WEEKDAY(A32,2)<7,LOOKUP(WEEKDAY(A32,2),MENY!$P$8:$P$14,MENY!$Q$8:$Q$14),\"\"))","v":"Fre"},null,null,null,null,"",0,{"$f":"IF(H32=11,\"Ordinær +\",IF(T32=1,IF(H32>0,LOOKUP(H32,MENY!$N$2:O41,MENY!$O$2:$O$18),IF(C32>0,IF(B32=\"Lør\",\"-\",\"Ordinær\"),\"-\")),\"Søndag\"))","v":"-"},null,0,0,null,0,"",null,null,"",null,1,"00:00:00",0,"00:00:00","00:00:00","00:00:00","00:00:00","00:00:00","00:00:00",0,0,0,0,0,"07:30:00","00:00:00",0,1]
["2019-05-25",{"$f":"IF(WEEKDAY(A34,2)=1,WEEKNUM(A33)*-1-MENY!$I$12,IF(WEEKDAY(A33,2)<7,LOOKUP(WEEKDAY(A33,2),MENY!$P$8:$P$14,MENY!$Q$8:$Q$14),\"\"))","v":"Lør"},null,null,null,null,"00:00:00",0,{"$f":"IF(H33=11,\"Ordinær +\",IF(T33=1,IF(H33>0,LOOKUP(H33,MENY!$N$2:O42,MENY!$O$2:$O$18),IF(C33>0,IF(B33=\"Lør\",\"-\",\"Ordinær\"),\"-\")),\"Søndag\"))","v":"-"},null,0,0,null,0,"",null,null,"",null,1,"","","00:00:00","","","","","",0,0,0,0,0,"07:30:00","00:00:00",0,1]
["2019-05-26",{"$f":"IF(WEEKDAY(A35,2)=1,WEEKNUM(A34)*-1-MENY!$I$12,IF(WEEKDAY(A34,2)<7,LOOKUP(WEEKDAY(A34,2),MENY!$P$8:$P$14,MENY!$Q$8:$Q$14),\"\"))","v":-22},null,null,null,null,"",0,{"$f":"IF(H34=11,\"Ordinær +\",IF(T34=1,IF(H34>0,LOOKUP(H34,MENY!$N$2:O43,MENY!$O$2:$O$18),IF(C34>0,IF(B34=\"Lør\",\"-\",\"Ordinær\"),\"-\")),\"Søndag\"))","v":"Søndag"},null,0,0,null,0,"",null,null,"",null,0,"00:00:00","","00:00:00","00:00:00","00:00:00","00:00:00","00:00:00","00:00:00",0,0,0,0,0,"07:30:00","00:00:00",0,1]
["2019-05-27",{"$f":"IF(WEEKDAY(A36,2)=1,WEEKNUM(A35)*-1-MENY!$I$12,IF(WEEKDAY(A35,2)<7,LOOKUP(WEEKDAY(A35,2),MENY!$P$8:$P$14,MENY!$Q$8:$Q$14),\"\"))","v":"Man"},null,null,null,null,"",0,{"$f":"IF(H35=11,\"Ordinær +\",IF(T35=1,IF(H35>0,LOOKUP(H35,MENY!$N$2:O44,MENY!$O$2:$O$18),IF(C35>0,IF(B35=\"Lør\",\"-\",\"Ordinær\"),\"-\")),\"Søndag\"))","v":"-"},null,0,0,null,0,"",null,null,"",null,{"$f":"IF(A35>0,IF(WEEKDAY(A35-1)<7,1,0),\"\")","v":1},"00:00:00",0,"00:00:00","00:00:00","00:00:00","00:00:00","00:00:00","00:00:00",0,0,0,0,0,"07:30:00","00:00:00",0,1]
["2019-05-28",{"$f":"IF(WEEKDAY(A37,2)=1,WEEKNUM(A36)*-1-MENY!$I$12,IF(WEEKDAY(A36,2)<7,LOOKUP(WEEKDAY(A36,2),MENY!$P$8:$P$14,MENY!$Q$8:$Q$14),\"\"))","v":"Tirs"},null,null,null,null,"",0,{"$f":"IF(H36=11,\"Ordinær +\",IF(T36=1,IF(H36>0,LOOKUP(H36,MENY!$N$2:O45,MENY!$O$2:$O$18),IF(C36>0,IF(B36=\"Lør\",\"-\",\"Ordinær\"),\"-\")),\"Søndag\"))","v":"-"},null,0,0,null,0,"",null,null,"",null,{"$f":"IF(A36>0,IF(WEEKDAY(A36-1)<7,1,0),\"\")","v":1},"00:00:00",0,"00:00:00","00:00:00","00:00:00","00:00:00","00:00:00","00:00:00",0,0,0,0,0,"07:30:00","00:00:00",0,1]
["2019-05-29",{"$f":"IF(WEEKDAY(A38,2)=1,WEEKNUM(A37)*-1-MENY!$I$12,IF(WEEKDAY(A37,2)<7,LOOKUP(WEEKDAY(A37,2),MENY!$P$8:$P$14,MENY!$Q$8:$Q$14),\"\"))","v":"Ons"},null,null,null,null,"",0,{"$f":"IF(H37=11,\"Ordinær +\",IF(T37=1,IF(H37>0,LOOKUP(H37,MENY!$N$2:O46,MENY!$O$2:$O$18),IF(C37>0,IF(B37=\"Lør\",\"-\",\"Ordinær\"),\"-\")),\"Søndag\"))","v":"-"},null,0,0,null,0,"",null,null,"",null,{"$f":"IF(A37>0,IF(WEEKDAY(A37-1)<7,1,0),\"\")","v":1},"00:00:00",0,"00:00:00","00:00:00","00:00:00","00:00:00","00:00:00","00:00:00",0,0,0,0,0,"07:30:00","00:00:00",0,1]
["2019-05-30",{"$f":"IF(WEEKDAY(A39,2)=1,WEEKNUM(A38)*-1-MENY!$I$12,IF(WEEKDAY(A38,2)<7,LOOKUP(WEEKDAY(A38,2),MENY!$P$8:$P$14,MENY!$Q$8:$Q$14),\"\"))","v":"Tors"},null,null,null,null,"",0,{"$f":"IF(A38>0,IF(H38=11,\"Ordinær +\",IF(T38=1,IF(H38>0,LOOKUP(H38,MENY!$N$2:O47,MENY!$O$2:$O$18),IF(C38>0,IF(B38=\"Lør\",\"-\",\"Ordinær\"),\"-\")),\"Søndag\")),\"-\")","v":"-"},null,0,0,null,0,"",null,null,"",null,{"$f":"IF(A38>0,IF(WEEKDAY(A38-1)<7,1,0),\"\")","v":1},"00:00:00",0,"00:00:00","00:00:00","00:00:00","00:00:00","00:00:00","00:00:00",0,0,0,0,0,"07:30:00","00:00:00",0,1]
["2019-05-31",{"$f":"IF(WEEKDAY(A40,2)=1,WEEKNUM(A39)*-1-MENY!$I$12,IF(WEEKDAY(A39,2)<7,LOOKUP(WEEKDAY(A39,2),MENY!$P$8:$P$14,MENY!$Q$8:$Q$14),\"\"))","v":"Fre"},null,null,null,null,"",0,{"$f":"IF(A39>0,IF(H39=11,\"Ordinær +\",IF(T39=1,IF(H39>0,LOOKUP(H39,MENY!$N$2:O48,MENY!$O$2:$O$18),IF(C39>0,IF(B39=\"Lør\",\"-\",\"Ordinær\"),\"-\")),\"Søndag\")),\"-\")","v":"-"},null,0,0,null,0,"",null,null,"",null,{"$f":"IF(A39>0,IF(WEEKDAY(A39-1)<7,1,0),\"\")","v":1},"00:00:00",0,"00:00:00","00:00:00","00:00:00","00:00:00",{"$f":"IF(B39=\"Lør\",\"\",IF(T39=1,IF(H39=9,AH39,0),0))","v":"00:00:00"},"00:00:00",0,0,0,0,0,"07:30:00","00:00:00",0,1]
[null,null,null,"Sum for denne måned",null,null,{"$f":"SUM(G9:G39)*24","v":0},null,null,null,{"$f":"SUM(K9:K39)+N49","v":0},{"$f":"SUM(L9:L39)","v":0},{"$f":"SUM(M9:M39)","v":0},{"$f":"SUM(N9:N39)-U40-AG41-SUM(K40:M40)+N50","v":0},{"$f":"SUM(O9:O39)","v":0},"Fravær denne måned",null,null,null,null,{"$f":"SUM(U9:U39)*24","v":0},{"$f":"SUM(V9:V39)","v":0},{"$f":"SUM(W9:W39)*24","v":0},0,0,0,0,0,{"$f":"SUM(AC9:AC39)","v":0},{"$f":"SUM(AD9:AD39)","v":0},{"$f":"SUM(AE9:AE39)","v":0},{"$f":"SUM(AF9:AF39)","v":0},{"$f":"SUM(AG9:AG39)","v":0}]
[null,null,null,"Overført fra forrige måned",null,null,null,null,null,null,null,null,null,{"$f":"APR!N47","v":0},{"$f":"APR!O42","v":0},"Type","Timer",null,null,null,null,null,null,null,null,null,null,null,null,null,null,"Sum deltidsfravær:",{"$f":"SUM(AC40:AG40)","v":0}]
[null,null,null,"Sum hittil i år",null,null,null,null,null,null,null,null,null,{"$f":"SUM(N40:N41)","v":0},{"$f":"SUM(O40:O41)","v":0},"06 Perm m/lønn",{"$f":"X40+AC40*-1","v":0}]
["Ferieregnskap",null,null,"Dager","Timeregnskap",null,null,null,null,null,null,null,null,"Timer",null,"07 Perm u/lønn",{"$f":"Y40+AD40*-1","v":0}]
["Disponible feriedager",null,null,{"$f":"APR!D47","v":25},"Opptjent denne måneden",null,null,null,null,null,null,null,null,{"$f":"SUM(N9:N39)-AG41-(SUM(K40:M40))+N50","v":0},null,"08 Sykemelding",{"$f":"(Z40+AE40*-1)","v":0}]
["Brukt denne måned",null,null,{"$f":"V40*-1","v":0},"Avspasert denne måneden",null,null,null,null,null,null,null,null,{"$f":"U40","v":0},null,"09 Egenmelding",{"$f":"(AA40+AF40*-1)","v":0}]
["Endring i feriedager",null,null,null,"Utbetalt overtid denne måned",null,null,null,null,null,null,null,null,{"$f":"SUM(K40:M40)","v":0},null,"10 Sykt barn",{"$f":"(AB40+AG40*-1)","v":0}]
["Til gode",null,null,{"$f":"SUM(D44:D46)","v":25},"Til gode for avspasering",null,null,null,null,null,null,null,null,{"$f":"N42","v":0},null,"Sum - Mai",{"$f":"SUM(Q42:Q46)","v":0}]
[null,null,null,null,"Effektiv arbeidstid denne måned",null,null,null,null,null,null,null,null,{"$f":"G40+N44+AG41+N46-N50","v":0},null,"Hittil i år",{"$f":"Q47+APR!Q48","v":0}]
[null,null,null,null,"Flexitid omgjort til overtid og utbetalt, denne måned"]
[null,null,null,null,"Annen korrigering av flexitid, OBS! skriv egen merknad"]
["Merknader"]
[]
[]
[]
[]
[]
["Overtid for utbetaling:",null,null,null,null,null,"Dato",null,null,null,null,null,null,null,"Dato"]
[null,null,null,"Timer med 50% tillegg :",{"$f":"K40","v":0}]
[null,null,null,"Timer med 100% tillegg:",{"$f":"L40","v":0}]
[null,null,null,"Timer med 133% tillegg:",{"$f":"M39","v":0},null,null,null,"Attestert",null,null,null,null,null,"Anvist"]
[]
[]
[null,null,null,null,null,null,null,null,null,null,null,null,null,null,null,{"$f":"MENY!D6","v":"Leder"}]
["© Ole Jørgen Klaussen - 2003",null,null,null,{"$f":"TODAY()","v":"2018-11-30"},{"$f":"YEAR(TODAY())","v":2018},null,null,null,null,null,null,null,null,null,null,"ole.klaussen@online.no"]

{"sheet":"JUN","index":6,"n_rows":64,"n_cols":37,"rows_kept":64,"cut":false,"hidden":false,"merged":[[11,15,11,16],[12,15,12,16],[13,15,13,16],[14,15,14,16],[5,19,5,22],[5,7,6,16],[2,1,2,6],[8,15,8,16],[9,15,9,16],[10,15,10,16],[2,15,2,16],[7,15,7,16],[6,3,6,4],[7,7,7,8],[15,15,15,16],[18,15,18,16],[19,15,19,16],[20,15,20,16],[16,15,16,16],[17,15,17,16],[38,15,38,16],[37,15,37,16],[36,15,36,16],[30,15,30,16],[31,15,31,16],[32,15,32,16],[33,15,33,16],[26,15,26,16],[27,15,27,16],[29,15,29,16],[34,15,34,16],[35,15,35,16],[1,28,2,33],[59,14,59,16],[62,6,62,10],[55,0,55,16],[56,6,56,10],[56,14,56,16],[51,0,51,16],[52,0,52,16],[53,0,53,16],[54,0,54,16],[28,15,28,16],[21,15,21,16],[22,15,22,16],[23,15,23,16],[24,15,24,16],[25,15,25,16]]}
["Meny","JAN","FEB","MAR","APR","MAI","JUN",null,null,null,null,null,null,null,null,null,"Hjelp","Viktig når det gjelder overtid"]
["Året","JUL","AUG","SEP","OKT","NOV","DES",null,null,null,null,null,null,null,null,"Dato",null,"For at føringer av aktiv arbeidstid skal bli riktig"]
[null,{"$f":"MENY!D4","v":"Min bedrift"},null,null,null,null,null,null,"Juni -",null,null,null,null,{"$f":"MENY!P1","v":2019},null,{"$f":"TODAY()","v":"2018-11-30"},null,"er det nødvendig at all arbeidstid registreres."]
[null,"Timeliste","Navn:",{"$f":"MENY!D5","v":"Min timeliste"},null,null,"Sommer",null,null,null,"Stillingsbrøk:",{"$f":"MENY!I5","v":1},null,"Vinter",null,null,null,"Dette gjelder også overtid. Så registrer  når du ",null,null,null,null,null,null,null,null,null,null,null,null,null,null,null,null,null,"MERK!"]
[null,null,"Sommerlukking fra/til:",null,{"$f":"MENY!Q18","v":"2019-05-15"},{"$f":"MENY!Q19","v":"2019-09-14"},{"$f":"(MENY!F13-MENY!E13-MENY!I13)*MENY!I5","v":"07:30:00"},null,{"$f":"MENY!I13","v":"00:00:00"},"  <-arbeidstid->",null,null,{"$f":"MENY!I14","v":"00:00:00"},{"$f":"(MENY!F14-MENY!E14-MENY!I14)*MENY!I5","v":"07:30:00"},null,null,null,"kommer på jobb (inn) og når du er ferdig (ut)",null,null,null,null,null,null,null,null,null,null,null,null,null,null,null,null,null,"Les her"]
["År ",null,null,null,null,null,null,"Fyll ut i arbeids og fraværskode : 0=ordinær  1=Avspasere  2=Ferie  3=Tjeneste  4=Plussdag  5=Helligdag  6=Perm M/lønn  7=Perm U/lønn  8=Sykemelding  9=Egenmelding 10=Sykt barn 11=Ordinær+ , 12 = plusstid som overtid",null,null,null,null,null,null,null,null,null,"Dersom noe av tiden skal utbetales i overtid, så",null,"Arbeidsdata",null,null,null,null,null,null,null,null,6,7,8,9,10,null,null,"Syke-","Stillings"]
[{"$f":"N3","v":2019},{"$f":"WEEKNUM(A9)+MENY!I12","v":22},"I dag","Fravær pr dag",null,"I dag",null,null,null,null,null,null,null,null,null,null,null,"legg inn antall timer nederst på arket.",null,null,null,null,null,6,7,8,9,10,12,13,14,15,16,null,null,"melding","brøk"]
["DATO","UKENR                               og DAG","Inn","Ut","Inn","Ut","Ordinær","Arbeids og fraværskode",null,"Fravær",0.5,1,1.33,"Balanse","Timer i dag","Merknad ",null,"Huskeliste",null,"Arbeids dag","Avsp","Ferie","Tjeneste","Perm m-lønn","Perm u-lønn","Sykemelding","Egenmelding","Sykt barn","Perm m-lønn","Perm u-lønn","Sykemelding","Egenmelding","Sykt barn","Ordinær arbeidstid","Trekk for matpause","i prosent andel"]
[{"$f":"DATE(MENY!P1,6,1)","v":"2019-06-01"},{"$f":"IF(WEEKDAY(A10,2)=1,WEEKNUM(A9)*-1-MENY!$I$12,IF(WEEKDAY(A9,2)<7,LOOKUP(WEEKDAY(A9,2),MENY!$P$8:$P$14,MENY!$Q$8:$Q$14),\"\"))","v":"Lør"},null,null,null,null,{"$f":"IF(H9=11,F9-C9-(E9-D9),IF(B9=\"Lør\",0,IF(H9=4,0,IF(H9=3,IF(T9>0,W9,\"\"),IF(H9=1,0, IF(C9>0,  AH9,       \"\"))))))","v":"00:00:00"},{"$f":"IF(B9=\"Lør\",IF(C9>0,4,0),0)","v":0},{"$f":"IF(H9=11,\"Ordinær +\",IF(T9=1,IF(H9>0,LOOKUP(H9,MENY!$N$2:O18,MENY!$O$2:$O$18),IF(C9>0,IF(B9=\"Lør\",\"-\",\"Ordinær\"),\"-\")),\"Søndag\"))","v":"-"},null,{"$f":"IF(H9=12,IF(N9>=4,4,N9),0)","v":0},{"$f":"IF(H9=12,IF(N9>K9,N9-4,0),0)","v":0},null,{"$f":"IF(H9=11,0,IF(T9=1,IF(H9=4,((F9-C9)-(E9-D9))*24,IF(C9>0,(F9-C9-(E9-D9)-G9-AI9)*24,0)),0))","v":0},{"$f":"IF(F9>0,G9*24+N9,\"\")","v":""},null,null,{"$f":"IF(O9=\"\",\"\",\"Husk, fordel timer til prosjekter\")","v":""},null,{"$f":"IF(WEEKDAY(A9-1)<7,1,0)","v":1},{"$f":"IF(B9=\"Lør\",\"\",IF(T9=1,IF(H9=1,AH9,0),0))","v":""},{"$f":"IF(T9=1,IF(B9=\"lør\",\"\",IF(H9=2,1,0)),\"\")","v":""},{"$f":"IF(T9=1,IF(H9=3,AH9,0),0)","v":"00:00:00"},{"$f":"IF(B9=\"lør\",\"\",IF(T9=1,IF(H9=6,AH9,0),0))","v":""},{"$f":"IF(B9=\"Lør\",\"\",IF(T9=1,IF(H9=7,AH9,0),0))","v":""},{"$f":"IF(AJ9>0,IF(C9>0,    (AH9*AJ9)/(1-AJ9),0),           IF(B9=\"Lør\",\"\",IF(T9=1,IF(H9=8,AH9,0),0)))","v":""},{"$f":"IF(B9=\"Lør\",\"\",IF(T9=1,IF(H9=9,AH9,0),0))","v":""},{"$f":"IF(B9=\"Lør\",\"\",IF(T9=1,IF(H9=10,AH9,0),0))","v":""},{"$f":"IF(J9=6,N9,0)","v":0},{"$f":"IF(J9=7,N9,0)","v":0},{"$f":"IF(J9=8,N9,0)","v":0},{"$f":"IF(J9=9,N9,0)","v":0},{"$f":"IF(J9=10,N9,0)","v":0},{"$f":"((IF(A9<$F$5+1,IF(A9>$E$5-1,$G$5,$N$5),$N$5))*(1-AJ9))*(AK9)","v":"07:30:00"},{"$f":"IF(A9<$F$5+1,IF(A9>$E$5-1,$I$5,$M$5),$M$5)","v":"00:00:00"},{"$f":"MAI!AJ39","v":0},{"$f":"MAI!AK39","v":1}]
[{"$f":"A9+1","v":"2019-06-02"},{"$f":"IF(WEEKDAY(A11,2)=1,WEEKNUM(A10)*-1-MENY!$I$12,IF(WEEKDAY(A10,2)<7,LOOKUP(WEEKDAY(A10,2),MENY!$P$8:$P$14,MENY!$Q$8:$Q$14),\"\"))","v":-23},null,null,null,null,{"$f":"IF(H10=11,F10-C10-(E10-D10),IF(B10=\"Lør\",0,IF(H10=4,0,IF(H10=3,IF(T10>0,W10,\"\"),IF(H10=1,0, IF(C10>0,  AH10,       \"\"))))))","v":""},0,{"$f":"IF(H10=11,\"Ordinær +\",IF(T10=1,IF(H10>0,LOOKUP(H10,MENY!$N$2:O19,MENY!$O$2:$O$18),IF(C10>0,IF(B10=\"Lør\",\"-\",\"Ordinær\"),\"-\")),\"Søndag\"))","v":"Søndag"},null,{"$f":"IF(H10=12,IF(N10>=4,4,N10),0)","v":0},{"$f":"IF(H10=12,IF(N10>K10,N10-4,0),0)","v":0},null,{"$f":"IF(H10=11,0,IF(T10=1,IF(H10=4,((F10-C10)-(E10-D10))*24,IF(C10>0,(F10-C10-(E10-D10)-G10-AI10)*24,0)),0))","v":0},{"$f":"IF(F10>0,G10*24+N10,\"\")","v":""},null,null,{"$f":"IF(O10=\"\",\"\",\"Husk, fordel timer til prosjekter\")","v":""},null,{"$f":"IF(WEEKDAY(A10-1)<7,1,0)","v":0},{"$f":"IF(B10=\"Lør\",\"\",IF(T10=1,IF(H10=1,AH10,0),0))","v":"00:00:00"},"",{"$f":"IF(T10=1,IF(H10=3,AH10,0),0)","v":"00:00:00"},{"$f":"IF(B10=\"lør\",\"\",IF(T10=1,IF(H10=6,AH10,0),0))","v":"00:00:00"},{"$f":"IF(B10=\"Lør\",\"\",IF(T10=1,IF(H10=7,AH10,0),0))","v":"00:00:00"},{"$f":"IF(AJ10>0,IF(C10>0,    (AH10*AJ10)/(1-AJ10),0),           IF(B10=\"Lør\",\"\",IF(T10=1,IF(H10=8,AH10,0),0)))","v":"00:00:00"},{"$f":"IF(B10=\"Lør\",\"\",IF(T10=1,IF(H10=9,AH10,0),0))","v":"00:00:00"},{"$f":"IF(B10=\"Lør\",\"\",IF(T10=1,IF(H10=10,AH10,0),0))","v":"00:00:00"},0,0,0,0,0,{"$f":"((IF(A10<$F$5+1,IF(A10>$E$5-1,$G$5,$N$5),$N$5))*(1-AJ10))*(AK10)","v":"07:30:00"},{"$f":"IF(A10<$F$5+1,IF(A10>$E$5-1,$I$5,$M$5),$M$5)","v":"00:00:00"},{"$f":"AJ9","v":0},{"$f":"AK9","v":1}]
[{"$f":"A10+1","v":"2019-06-03"},{"$f":"IF(WEEKDAY(A12,2)=1,WEEKNUM(A11)*-1-MENY!$I$12,IF(WEEKDAY(A11,2)<7,LOOKUP(WEEKDAY(A11,2),MENY!$P$8:$P$14,MENY!$Q$8:$Q$14),\"\"))","v":"Man"},null,null,null,null,{"$f":"IF(H11=11,F11-C11-(E11-D11),IF(B11=\"Lør\",0,IF(H11=4,0,IF(H11=3,IF(T11>0,W11,\"\"),IF(H11=1,0, IF(C11>0,  AH11,       \"\"))))))","v":""},0,{"$f":"IF(H11=11,\"Ordinær +\",IF(T11=1,IF(H11>0,LOOKUP(H11,MENY!$N$2:O20,MENY!$O$2:$O$18),IF(C11>0,IF(B11=\"Lør\",\"-\",\"Ordinær\"),\"-\")),\"Søndag\"))","v":"-"},null,0,0,null,0,"",null,null,"",null,1,"00:00:00",0,"00:00:00","00:00:00","00:00:00","00:00:00","00:00:00","00:00:00",0,0,0,0,0,"07:30:00","00:00:00",{"$f":"AJ10","v":0},{"$f":"AK10","v":1}]
["2019-06-04",{"$f":"IF(WEEKDAY(A13,2)=1,WEEKNUM(A12)*-1-MENY!$I$12,IF(WEEKDAY(A12,2)<7,LOOKUP(WEEKDAY(A12,2),MENY!$P$8:$P$14,MENY!$Q$8:$Q$14),\"\"))","v":"Tirs"},null,null,null,null,"",0,{"$f":"IF(H12=11,\"Ordinær +\",IF(T12=1,IF(H12>0,LOOKUP(H12,MENY!$N$2:O21,MENY!$O$2:$O$18),IF(C12>0,IF(B12=\"Lør\",\"-\",\"Ordinær\"),\"-\")),\"Søndag\"))","v":"-"},null,0,0,null,0,"",null,null,"",null,1,"00:00:00",0,"00:00:00","00:00:00","00:00:00","00:00:00","00:00:00","00:00:00",0,0,0,0,0,"07:30:00","00:00:00",0,1]
["2019-06-05",{"$f":"IF(WEEKDAY(A14,2)=1,WEEKNUM(A13)*-1-MENY!$I$12,IF(WEEKDAY(A13,2)<7,LOOKUP(WEEKDAY(A13,2),MENY!$P$8:$P$14,MENY!$Q$8:$Q$14),\"\"))","v":"Ons"},null,null,null,null,"",0,{"$f":"IF(H13=11,\"Ordinær +\",IF(T13=1,IF(H13>0,LOOKUP(H13,MENY!$N$2:O22,MENY!$O$2:$O$18),IF(C13>0,IF(B13=\"Lør\",\"-\",\"Ordinær\"),\"-\")),\"Søndag\"))","v":"-"},null,0,0,null,0,"",null,null,"",null,1,"00:00:00",0,"00:00:00","00:00:00","00:00:00","00:00:00","00:00:00","00:00:00",0,0,0,0,0,"07:30:00","00:00:00",0,1]
["2019-06-06",{"$f":"IF(WEEKDAY(A15,2)=1,WEEKNUM(A14)*-1-MENY!$I$12,IF(WEEKDAY(A14,2)<7,LOOKUP(WEEKDAY(A14,2),MENY!$P$8:$P$14,MENY!$Q$8:$Q$14),\"\"))","v":"Tors"},null,null,null,null,"",0,{"$f":"IF(H14=11,\"Ordinær +\",IF(T14=1,IF(H14>0,LOOKUP(H14,MENY!$N$2:O23,MENY!$O$2:$O$18),IF(C14>0,IF(B14=\"Lør\",\"-\",\"Ordinær\"),\"-\")),\"Søndag\"))","v":"-"},null,0,0,null,0,"",null,null,"",null,1,"00:00:00",0,"00:00:00","00:00:00","00:00:00","00:00:00","00:00:00","00:00:00",0,0,0,0,0,"07:30:00","00:00:00",0,1]
["2019-06-07",{"$f":"IF(WEEKDAY(A16,2)=1,WEEKNUM(A15)*-1-MENY!$I$12,IF(WEEKDAY(A15,2)<7,LOOKUP(WEEKDAY(A15,2),MENY!$P$8:$P$14,MENY!$Q$8:$Q$14),\"\"))","v":"Fre"},null,null,null,null,"",0,{"$f":"IF(H15=11,\"Ordinær +\",IF(T15=1,IF(H15>0,LOOKUP(H15,MENY!$N$2:O24,MENY!$O$2:$O$18),IF(C15>0,IF(B15=\"Lør\",\"-\",\"Ordinær\"),\"-\")),\"Søndag\"))","v":"-"},null,0,0,null,0,"",null,null,"",null,1,"00:00:00",0,"00:00:00","00:00:00","00:00:00","00:00:00","00:00:00","00:00:00",0,0,0,0,0,"07:30:00","00:00:00",0,1]
["2019-06-08",{"$f":"IF(WEEKDAY(A17,2)=1,WEEKNUM(A16)*-1-MENY!$I$12,IF(WEEKDAY(A16,2)<7,LOOKUP(WEEKDAY(A16,2),MENY!$P$8:$P$14,MENY!$Q$8:$Q$14),\"\"))","v":"Lør"},null,null,null,null,"00:00:00",0,{"$f":"IF(H16=11,\"Ordinær +\",IF(T16=1,IF(H16>0,LOOKUP(H16,MENY!$N$2:O25,MENY!$O$2:$O$18),IF(C16>0,IF(B16=\"Lør\",\"-\",\"Ordinær\"),\"-\")),\"Søndag\"))","v":"-"},null,0,0,null,0,"",null,null,"",null,1,"","","00:00:00","","","","","",0,0,0,0,0,"07:30:00","00:00:00",0,1]
["2019-06-09",{"$f":"IF(WEEKDAY(A18,2)=1,WEEKNUM(A17)*-1-MENY!$I$12,IF(WEEKDAY(A17,2)<7,LOOKUP(WEEKDAY(A17,2),MENY!$P$8:$P$14,MENY!$Q$8:$Q$14),\"\"))","v":-24},null,null,null,null,"",0,{"$f":"IF(H17=11,\"Ordinær +\",IF(T17=1,IF(H17>0,LOOKUP(H17,MENY!$N$2:O26,MENY!$O$2:$O$18),IF(C17>0,IF(B17=\"Lør\",\"-\",\"Ordinær\"),\"-\")),\"Søndag\"))","v":"Søndag"},null,0,0,null,0,"",null,null,"",null,0,"00:00:00","","00:00:00","00:00:00","00:00:00","00:00:00","00:00:00","00:00:00",0,0,0,0,0,"07:30:00","00:00:00",0,1]
["2019-06-10",{"$f":"IF(WEEKDAY(A19,2)=1,WEEKNUM(A18)*-1-MENY!$I$12,IF(WEEKDAY(A18,2)<7,LOOKUP(WEEKDAY(A18,2),MENY!$P$8:$P$14,MENY!$Q$8:$Q$14),\"\"))","v":"Man"},null,null,null,null,"",0,{"$f":"IF(H18=11,\"Ordinær +\",IF(T18=1,IF(H18>0,LOOKUP(H18,MENY!$N$2:O27,MENY!$O$2:$O$18),IF(C18>0,IF(B18=\"Lør\",\"-\",\"Ordinær\"),\"-\")),\"Søndag\"))","v":"-"},null,0,0,null,0,"",null,null,"",null,1,"00:00:00",0,"00:00:00","00:00:00","00:00:00","00:00:00","00:00:00","00:00:00",0,0,0,0,0,"07:30:00","00:00:00",0,1]
["2019-06-11",{"$f":"IF(WEEKDAY(A20,2)=1,WEEKNUM(A19)*-1-MENY!$I$12,IF(WEEKDAY(A19,2)<7,LOOKUP(WEEKDAY(A19,2),MENY!$P$8:$P$14,MENY!$Q$8:$Q$14),\"\"))","v":"Tirs"},null,null,null,null,"",0,{"$f":"IF(H19=11,\"Ordinær +\",IF(T19=1,IF(H19>0,LOOKUP(H19,MENY!$N$2:O28,MENY!$O$2:$O$18),IF(C19>0,IF(B19=\"Lør\",\"-\",\"Ordinær\"),\"-\")),\"Søndag\"))","v":"-"},null,0,0,null,0,"",null,null,"",null,1,"00:00:00",0,"00:00:00","00:00:00","00:00:00","00:00:00","00:00:00","00:00:00",0,0,0,0,0,"07:30:00","00:00:00",0,1]
["2019-06-12",{"$f":"IF(WEEKDAY(A21,2)=1,WEEKNUM(A20)*-1-MENY!$I$12,IF(WEEKDAY(A20,2)<7,LOOKUP(WEEKDAY(A20,2),MENY!$P$8:$P$14,MENY!$Q$8:$Q$14),\"\"))","v":"Ons"},null,null,null,null,"",0,{"$f":"IF(H20=11,\"Ordinær +\",IF(T20=1,IF(H20>0,LOOKUP(H20,MENY!$N$2:O29,MENY!$O$2:$O$18),IF(C20>0,IF(B20=\"Lør\",\"-\",\"Ordinær\"),\"-\")),\"Søndag\"))","v":"-"},null,0,0,null,0,"",null,null,"",null,1,"00:00:00",0,"00:00:00","00:00:00","00:00:00","00:00:00","00:00:00","00:00:00",0,0,0,0,0,"07:30:00","00:00:00",0,1]
["2019-06-13",{"$f":"IF(WEEKDAY(A22,2)=1,WEEKNUM(A21)*-1-MENY!$I$12,IF(WEEKDAY(A21,2)<7,LOOKUP(WEEKDAY(A21,2),MENY!$P$8:$P$14,MENY!$Q$8:$Q$14),\"\"))","v":"Tors"},null,null,null,null,"",0,{"$f":"IF(H21=11,\"Ordinær +\",IF(T21=1,IF(H21>0,LOOKUP(H21,MENY!$N$2:O30,MENY!$O$2:$O$18),IF(C21>0,IF(B21=\"Lør\",\"-\",\"Ordinær\"),\"-\")),\"Søndag\"))","v":"-"},null,0,0,null,0,"",null,null,"",null,1,"00:00:00",0,"00:00:00","00:00:00","00:00:00","00:00:00","00:00:00","00:00:00",0,0,0,0,0,"07:30:00","00:00:00",0,1]
["2019-06-14",{"$f":"IF(WEEKDAY(A23,2)=1,WEEKNUM(A22)*-1-MENY!$I$12,IF(WEEKDAY(A22,2)<7,LOOKUP(WEEKDAY(A22,2),MENY!$P$8:$P$14,MENY!$Q$8:$Q$14),\"\"))","v":"Fre"},null,null,null,null,"",0,{"$f":"IF(H22=11,\"Ordinær +\",IF(T22=1,IF(H22>0,LOOKUP(H22,MENY!$N$2:O31,MENY!$O$2:$O$18),IF(C22>0,IF(B22=\"Lør\",\"-\",\"Ordinær\"),\"-\")),\"Søndag\"))","v":"-"},null,0,0,null,0,"",null,null,"",null,1,"00:00:00",0,"00:00:00","00:00:00","00:00:00","00:00:00","00:00:00","00:00:00",0,0,0,0,0,"07:30:00","00:00:00",0,1]
["2019-06-15",{"$f":"IF(WEEKDAY(A24,2)=1,WEEKNUM(A23)*-1-MENY!$I$12,IF(WEEKDAY(A23,2)<7,LOOKUP(WEEKDAY(A23,2),MENY!$P$8:$P$14,MENY!$Q$8:$Q$14),\"\"))","v":"Lør"},null,null,null,null,"00:00:00",0,{"$f":"IF(H23=11,\"Ordinær +\",IF(T23=1,IF(H23>0,LOOKUP(H23,MENY!$N$2:O32,MENY!$O$2:$O$18),IF(C23>0,IF(B23=\"Lør\",\"-\",\"Ordinær\"),\"-\")),\"Søndag\"))","v":"-"},null,0,0,null,0,"",null,null,"",null,1,"","","00:00:00","","","","","",0,0,0,0,0,"07:30:00","00:00:00",0,1]
["2019-06-16",{"$f":"IF(WEEKDAY(A25,2)=1,WEEKNUM(A24)*-1-MENY!$I$12,IF(WEEKDAY(A24,2)<7,LOOKUP(WEEKDAY(A24,2),MENY!$P$8:$P$14,MENY!$Q$8:$Q$14),\"\"))","v":-25},null,null,null,null,"",0,{"$f":"IF(H24=11,\"Ordinær +\",IF(T24=1,IF(H24>0,LOOKUP(H24,MENY!$N$2:O33,MENY!$O$2:$O$18),IF(C24>0,IF(B24=\"Lør\",\"-\",\"Ordinær\"),\"-\")),\"Søndag\"))","v":"Søndag"},null,0,0,null,0,"",null,null,"",null,0,"00:00:00","","00:00:00","00:00:00","00:00:00","00:00:00","00:00:00","00:00:00",0,0,0,0,0,"07:30:00","00:00:00",0,1]
["2019-06-17",{"$f":"IF(WEEKDAY(A26,2)=1,WEEKNUM(A25)*-1-MENY!$I$12,IF(WEEKDAY(A25,2)<7,LOOKUP(WEEKDAY(A25,2),MENY!$P$8:$P$14,MENY!$Q$8:$Q$14),\"\"))","v":"Man"},null,null,null,null,"",0,{"$f":"IF(H25=11,\"Ordinær +\",IF(T25=1,IF(H25>0,LOOKUP(H25,MENY!$N$2:O34,MENY!$O$2:$O$18),IF(C25>0,IF(B25=\"Lør\",\"-\",\"Ordinær\"),\"-\")),\"Søndag\"))","v":"-"},null,0,0,null,0,"",null,null,"",null,1,"00:00:00",0,"00:00:00","00:00:00","00:00:00","00:00:00","00:00:00","00:00:00",0,0,0,0,0,"07:30:00","00:00:00",0,1]
["2019-06-18",{"$f":"IF(WEEKDAY(A27,2)=1,WEEKNUM(A26)*-1-MENY!$I$12,IF(WEEKDAY(A26,2)<7,LOOKUP(WEEKDAY(A26,2),MENY!$P$8:$P$14,MENY!$Q$8:$Q$14),\"\"))","v":"Tirs"},null,null,null,null,"",0,{"$f":"IF(H26=11,\"Ordinær +\",IF(T26=1,IF(H26>0,LOOKUP(H26,MENY!$N$2:O35,MENY!$O$2:$O$18),IF(C26>0,IF(B26=\"Lør\",\"-\",\"Ordinær\"),\"-\")),\"Søndag\"))","v":"-"},null,0,0,null,0,"",null,null,"",null,1,"00:00:00",0,"00:00:00","00:00:00","00:00:00","00:00:00","00:00:00","00:00:00",0,0,0,0,0,"07:30:00","00:00:00",0,1]
["2019-06-19",{"$f":"IF(WEEKDAY(A28,2)=1,WEEKNUM(A27)*-1-MENY!$I$12,IF(WEEKDAY(A27,2)<7,LOOKUP(WEEKDAY(A27,2),MENY!$P$8:$P$14,MENY!$Q$8:$Q$14),\"\"))","v":"Ons"},null,null,null,null,"",0,{"$f":"IF(H27=11,\"Ordinær +\",IF(T27=1,IF(H27>0,LOOKUP(H27,MENY!$N$2:O36,MENY!$O$2:$O$18),IF(C27>0,IF(B27=\"Lør\",\"-\",\"Ordinær\"),\"-\")),\"Søndag\"))","v":"-"},null,0,0,null,0,"",null,null,"",null,1,"00:00:00",0,"00:00:00","00:00:00","00:00:00","00:00:00","00:00:00","00:00:00",0,0,0,0,0,"07:30:00","00:00:00",0,1]
["2019-06-20",{"$f":"IF(WEEKDAY(A29,2)=1,WEEKNUM(A28)*-1-MENY!$I$12,IF(WEEKDAY(A28,2)<7,LOOKUP(WEEKDAY(A28,2),MENY!$P$8:$P$14,MENY!$Q$8:$Q$14),\"\"))","v":"Tors"},null,null,null,null,"",0,{"$f":"IF(H28=11,\"Ordinær +\",IF(T28=1,IF(H28>0,LOOKUP(H28,MENY!$N$2:O37,MENY!$O$2:$O$18),IF(C28>0,IF(B28=\"Lør\",\"-\",\"Ordinær\"),\"-\")),\"Søndag\"))","v":"-"},null,0,0,null,0,"",null,null,"",null,1,"00:00:00",0,"00:00:00","00:00:00","00:00:00","00:00:00","00:00:00","00:00:00",0,0,0,0,0,"07:30:00","00:00:00",0,1]
["2019-06-21",{"$f":"IF(WEEKDAY(A30,2)=1,WEEKNUM(A29)*-1-MENY!$I$12,IF(WEEKDAY(A29,2)<7,LOOKUP(WEEKDAY(A29,2),MENY!$P$8:$P$14,MENY!$Q$8:$Q$14),\"\"))","v":"Fre"},null,null,null,null,"",0,{"$f":"IF(H29=11,\"Ordinær +\",IF(T29=1,IF(H29>0,LOOKUP(H29,MENY!$N$2:O38,MENY!$O$2:$O$18),IF(C29>0,IF(B29=\"Lør\",\"-\",\"Ordinær\"),\"-\")),\"Søndag\"))","v":"-"},null,0,0,null,0,"",null,null,"",null,1,"00:00:00",0,"00:00:00","00:00:00","00:00:00","00:00:00","00:00:00","00:00:00",0,0,0,0,0,"07:30:00","00:00:00",0,1]
["2019-06-22",{"$f":"IF(WEEKDAY(A31,2)=1,WEEKNUM(A30)*-1-MENY!$I$12,IF(WEEKDAY(A30,2)<7,LOOKUP(WEEKDAY(A30,2),MENY!$P$8:$P$14,MENY!$Q$8:$Q$14),\"\"))","v":"Lør"},null,null,null,null,"00:00:00",0,{"$f":"IF(H30=11,\"Ordinær +\",IF(T30=1,IF(H30>0,LOOKUP(H30,MENY!$N$2:O39,MENY!$O$2:$O$18),IF(C30>0,IF(B30=\"Lør\",\"-\",\"Ordinær\"),\"-\")),\"Søndag\"))","v":"-"},null,0,0,null,0,"",null,null,"",null,1,"","","00:00:00","","","","","",0,0,0,0,0,"07:30:00","00:00:00",0,1]
["2019-06-23",{"$f":"IF(WEEKDAY(A32,2)=1,WEEKNUM(A31)*-1-MENY!$I$12,IF(WEEKDAY(A31,2)<7,LOOKUP(WEEKDAY(A31,2),MENY!$P$8:$P$14,MENY!$Q$8:$Q$14),\"\"))","v":-26},null,null,null,null,"",0,{"$f":"IF(H31=11,\"Ordinær +\",IF(T31=1,IF(H31>0,LOOKUP(H31,MENY!$N$2:O40,MENY!$O$2:$O$18),IF(C31>0,IF(B31=\"Lør\",\"-\",\"Ordinær\"),\"-\")),\"Søndag\"))","v":"Søndag"},null,0,0,null,0,"",null,null,"",null,0,"00:00:00","","00:00:00","00:00:00","00:00:00","00:00:00","00:00:00","00:00:00",0,0,0,0,0,"07:30:00","00:00:00",0,1]
["2019-06-24",{"$f":"IF(WEEKDAY(A33,2)=1,WEEKNUM(A32)*-1-MENY!$I$12,IF(WEEKDAY(A32,2)<7,LOOKUP(WEEKDAY(A32,2),MENY!$P$8:$P$14,MENY!$Q$8:$Q$14),\"\"))","v":"Man"},null,null,null,null,"",0,{"$f":"IF(H32=11,\"Ordinær +\",IF(T32=1,IF(H32>0,LOOKUP(H32,MENY!$N$2:O41,MENY!$O$2:$O$18),IF(C32>0,IF(B32=\"Lør\",\"-\",\"Ordinær\"),\"-\")),\"Søndag\"))","v":"-"},null,0,0,null,0,"",null,null,"",null,1,"00:00:00",0,"00:00:00","00:00:00","00:00:00","00:00:00","00:00:00","00:00:00",0,0,0,0,0,"07:30:00","00:00:00",0,1]
["2019-06-25",{"$f":"IF(WEEKDAY(A34,2)=1,WEEKNUM(A33)*-1-MENY!$I$12,IF(WEEKDAY(A33,2)<7,LOOKUP(WEEKDAY(A33,2),MENY!$P$8:$P$14,MENY!$Q$8:$Q$14),\"\"))","v":"Tirs"},null,null,null,null,"",0,{"$f":"IF(H33=11,\"Ordinær +\",IF(T33=1,IF(H33>0,LOOKUP(H33,MENY!$N$2:O42,MENY!$O$2:$O$18),IF(C33>0,IF(B33=\"Lør\",\"-\",\"Ordinær\"),\"-\")),\"Søndag\"))","v":"-"},null,0,0,null,0,"",null,null,"",null,1,"00:00:00",0,"00:00:00","00:00:00","00:00:00","00:00:00","00:00:00","00:00:00",0,0,0,0,0,"07:30:00","00:00:00",0,1]
["2019-06-26",{"$f":"IF(WEEKDAY(A35,2)=1,WEEKNUM(A34)*-1-MENY!$I$12,IF(WEEKDAY(A34,2)<7,LOOKUP(WEEKDAY(A34,2),MENY!$P$8:$P$14,MENY!$Q$8:$Q$14),\"\"))","v":"Ons"},null,null,null,null,"",0,{"$f":"IF(H34=11,\"Ordinær +\",IF(T34=1,IF(H34>0,LOOKUP(H34,MENY!$N$2:O43,MENY!$O$2:$O$18),IF(C34>0,IF(B34=\"Lør\",\"-\",\"Ordinær\"),\"-\")),\"Søndag\"))","v":"-"},null,0,0,null,0,"",null,null,"",null,1,"00:00:00",0,"00:00:00","00:00:00","00:00:00","00:00:00","00:00:00","00:00:00",0,0,0,0,0,"07:30:00","00:00:00",0,1]
["2019-06-27",{"$f":"IF(WEEKDAY(A36,2)=1,WEEKNUM(A35)*-1-MENY!$I$12,IF(WEEKDAY(A35,2)<7,LOOKUP(WEEKDAY(A35,2),MENY!$P$8:$P$14,MENY!$Q$8:$Q$14),\"\"))","v":"Tors"},null,null,null,null,"",0,{"$f":"IF(H35=11,\"Ordinær +\",IF(T35=1,IF(H35>0,LOOKUP(H35,MENY!$N$2:O44,MENY!$O$2:$O$18),IF(C35>0,IF(B35=\"Lør\",\"-\",\"Ordinær\"),\"-\")),\"Søndag\"))","v":"-"},null,0,0,null,0,"",null,null,"",null,{"$f":"IF(A35>0,IF(WEEKDAY(A35-1)<7,1,0),\"\")","v":1},"00:00:00",0,"00:00:00","00:00:00","00:00:00","00:00:00","00:00:00","00:00:00",0,0,0,0,0,"07:30:00","00:00:00",0,1]
["2019-06-28",{"$f":"IF(WEEKDAY(A37,2)=1,WEEKNUM(A36)*-1-MENY!$I$12,IF(WEEKDAY(A36,2)<7,LOOKUP(WEEKDAY(A36,2),MENY!$P$8:$P$14,MENY!$Q$8:$Q$14),\"\"))","v":"Fre"},null,null,null,null,"",0,{"$f":"IF(H36=11,\"Ordinær +\",IF(T36=1,IF(H36>0,LOOKUP(H36,MENY!$N$2:O45,MENY!$O$2:$O$18),IF(C36>0,IF(B36=\"Lør\",\"-\",\"Ordinær\"),\"-\")),\"Søndag\"))","v":"-"},null,0,0,null,0,"",null,null,"",null,{"$f":"IF(A36>0,IF(WEEKDAY(A36-1)<7,1,0),\"\")","v":1},"00:00:00",0,"00:00:00","00:00:00","00:00:00","00:00:00","00:00:00","00:00:00",0,0,0,0,0,"07:30:00","00:00:00",0,1]
["2019-06-29",{"$f":"IF(WEEKDAY(A38,2)=1,WEEKNUM(A37)*-1-MENY!$I$12,IF(WEEKDAY(A37,2)<7,LOOKUP(WEEKDAY(A37,2),MENY!$P$8:$P$14,MENY!$Q$8:$Q$14),\"\"))","v":"Lør"},null,null,null,null,"00:00:00",0,{"$f":"IF(H37=11,\"Ordinær +\",IF(T37=1,IF(H37>0,LOOKUP(H37,MENY!$N$2:O46,MENY!$O$2:$O$18),IF(C37>0,IF(B37=\"Lør\",\"-\",\"Ordinær\"),\"-\")),\"Søndag\"))","v":"-"},null,0,0,null,0,"",null,null,"",null,{"$f":"IF(A37>0,IF(WEEKDAY(A37-1)<7,1,0),\"\")","v":1},"","","00:00:00","","","","","",0,0,0,0,0,"07:30:00","00:00:00",0,1]
["2019-06-30",{"$f":"IF(WEEKDAY(A39,2)=1,WEEKNUM(A38)*-1-MENY!$I$12,IF(WEEKDAY(A38,2)<7,LOOKUP(WEEKDAY(A38,2),MENY!$P$8:$P$14,MENY!$Q$8:$Q$14),\"\"))","v":""},null,null,null,null,"",0,{"$f":"IF(H38=11,\"Ordinær +\",IF(T38=1,IF(H38>0,LOOKUP(H38,MENY!$N$2:O47,MENY!$O$2:$O$18),IF(C38>0,IF(B38=\"Lør\",\"-\",\"Ordinær\"),\"-\")),\"Søndag\"))","v":"Søndag"},null,0,0,null,0,"",null,null,"",null,{"$f":"IF(A38>0,IF(WEEKDAY(A38-1)<7,1,0),\"\")","v":0},"00:00:00","","00:00:00","00:00:00","00:00:00","00:00:00","00:00:00","00:00:00",0,0,0,0,0,"07:30:00","00:00:00",0,1]
[null,null,null,null,null,null,"",0,{"$f":"IF(A39>0,IF(H39=11,\"Ordinær +\",IF(T39=1,IF(H39>0,LOOKUP(H39,MENY!$N$2:O48,MENY!$O$2:$O$18),IF(C39>0,IF(B39=\"Lør\",\"-\",\"Ordinær\"),\"-\")),\"Søndag\")),\"-\")","v":"-"},null,0,0,null,0,"",null,null,"",null,{"$f":"IF(A39>0,IF(WEEKDAY(A39-1)<7,1,0),\"\")","v":""},"00:00:00","","00:00:00","00:00:00","00:00:00","00:00:00",{"$f":"IF(B39=\"Lør\",\"\",IF(T39=1,IF(H39=9,AH39,0),0))","v":"00:00:00"},"00:00:00",0,0,0,0,0,"07:30:00","00:00:00",0,1]
[null,null,null,"Sum for denne måned",null,null,{"$f":"SUM(G9:G39)*24","v":0},null,null,null,{"$f":"SUM(K9:K39)+N49","v":0},{"$f":"SUM(L9:L39)","v":0},{"$f":"SUM(M9:M39)","v":0},{"$f":"SUM(N9:N39)-U40-AG41-SUM(K40:M40)+N50","v":0},{"$f":"SUM(O9:O39)","v":0},"Fravær denne måned",null,null,null,null,{"$f":"SUM(U9:U39)*24","v":0},{"$f":"SUM(V9:V39)","v":0},{"$f":"SUM(W9:W39)*24","v":0},0,0,0,0,0,{"$f":"SUM(AC9:AC39)","v":0},{"$f":"SUM(AD9:AD39)","v":0},{"$f":"SUM(AE9:AE39)","v":0},{"$f":"SUM(AF9:AF39)","v":0},{"$f":"SUM(AG9:AG39)","v":0}]
[null,null,null,"Overført fra forrige måned",null,null,null,null,null,null,null,null,null,{"$f":"MAI!N47","v":0},{"$f":"MAI!O42","v":0},"Type","Timer",null,null,null,null,null,null,null,null,null,null,null,null,null,null,"Sum deltidsfravær:",{"$f":"SUM(AC40:AG40)","v":0}]
[null,null,null,"Sum hittil i år",null,null,null,null,null,null,null,null,null,{"$f":"SUM(N40:N41)","v":0},{"$f":"SUM(O40:O41)","v":0},"06 Perm m/lønn",{"$f":"X40+AC40*-1","v":0}]
["Ferieregnskap",null,null,"Dager","Timeregnskap",null,null,null,null,null,null,null,null,"Timer",null,"07 Perm u/lønn",{"$f":"Y40+AD40*-1","v":0}]
["Disponible feriedager",null,null,{"$f":"MAI!D47","v":25},"Opptjent denne måneden",null,null,null,null,null,null,null,null,{"$f":"SUM(N9:N39)-AG41-(SUM(K40:M40))+N50","v":0},null,"08 Sykemelding",{"$f":"(Z40+AE40*-1)","v":0}]
["Brukt denne måned",null,null,{"$f":"V40*-1","v":0},"Avspasert denne måneden",null,null,null,null,null,null,null,null,{"$f":"U40","v":0},null,"09 Egenmelding",{"$f":"(AA40+AF40*-1)","v":0}]
["Endring i feriedager",null,null,null,"Utbetalt overtid denne måned",null,null,null,null,null,null,null,null,{"$f":"SUM(K40:M40)","v":0},null,"10 Sykt barn",{"$f":"(AB40+AG40*-1)","v":0}]
["Til gode",null,null,{"$f":"SUM(D44:D46)","v":25},"Til gode for avspasering",null,null,null,null,null,null,null,null,{"$f":"N42","v":0},null,"Sum - Juni",{"$f":"SUM(Q42:Q46)","v":0}]
[null,null,null,null,"Effektiv arbeidstid denne måned",null,null,null,null,null,null,null,null,{"$f":"G40+N44+AG41+N46-N50","v":0},null,"Hittil i år",{"$f":"Q47+MAI!Q48","v":0}]
[null,null,null,null,"Flexitid omgjort til overtid og utbetalt, denne måned"]
[null,null,null,null,"Annen korrigering av flexitid, OBS! skriv egen merknad"]
["Merknader"]
[]
[]
[]
[]
[]
["Overtid for utbetaling:",null,null,null,null,null,"Dato",null,null,null,null,null,null,null,"Dato"]
[null,null,null,"Timer med 50% tillegg :",{"$f":"K40","v":0}]
[null,null,null,"Timer med 100% tillegg:",{"$f":"L40","v":0}]
[null,null,null,"Timer med 133% tillegg:",{"$f":"M39","v":0},null,null,null,"Attestert",null,null,null,null,null,"Anvist"]
[]
[]
[null,null,null,null,null,null,null,null,null,null,null,null,null,null,null,{"$f":"MENY!D6","v":"Leder"}]
["© Ole Jørgen Klaussen - 2003",null,null,null,{"$f":"TODAY()","v":"2018-11-30"},{"$f":"YEAR(TODAY())","v":2018},null,null,null,null,null,null,null,null,null,null,"ole.klaussen@online.no"]

{"sheet":"JUL","index":7,"n_rows":64,"n_cols":37,"rows_kept":64,"cut":false,"hidden":false,"merged":[[11,15,11,16],[12,15,12,16],[13,15,13,16],[14,15,14,16],[5,19,5,22],[5,7,6,16],[2,1,2,6],[8,15,8,16],[9,15,9,16],[10,15,10,16],[2,15,2,16],[7,15,7,16],[6,3,6,4],[7,7,7,8],[15,15,15,16],[18,15,18,16],[19,15,19,16],[20,15,20,16],[16,15,16,16],[17,15,17,16],[38,15,38,16],[37,15,37,16],[36,15,36,16],[30,15,30,16],[31,15,31,16],[32,15,32,16],[33,15,33,16],[26,15,26,16],[27,15,27,16],[29,15,29,16],[34,15,34,16],[35,15,35,16],[1,28,2,33],[59,14,59,16],[62,6,62,10],[55,0,55,16],[56,6,56,10],[56,14,56,16],[51,0,51,16],[52,0,52,16],[53,0,53,16],[54,0,54,16],[28,15,28,16],[21,15,21,16],[22,15,22,16],[23,15,23,16],[24,15,24,16],[25,15,25,16]]}
["Meny","JAN","FEB","MAR","APR","MAI","JUN",null,null,null,null,null,null,null,null,null,"Hjelp","Viktig når det gjelder overtid"]
["Året","JUL","AUG","SEP","OKT","NOV","DES",null,null,null,null,null,null,null,null,"Dato",null,"For at føringer av aktiv arbeidstid skal bli riktig"]
[null,{"$f":"MENY!D4","v":"Min bedrift"},null,null,null,null,null,null,"Juli -",null,null,null,null,{"$f":"MENY!P1","v":2019},null,{"$f":"TODAY()","v":"2018-11-30"},null,"er det nødvendig at all arbeidstid registreres."]
[null,"Timeliste","Navn:",{"$f":"MENY!D5","v":"Min timeliste"},null,null,"Sommer",null,null,null,"Stillingsbrøk:",{"$f":"MENY!I5","v":1},null,"Vinter",null,null,null,"Dette gjelder også overtid. Så registrer  når du ",null,null,null,null,null,null,null,null,null,null,null,null,null,null,null,null,null,"MERK!"]
[null,null,"Sommerlukking fra/til:",null,{"$f":"MENY!Q18","v":"2019-05-15"},{"$f":"MENY!Q19","v":"2019-09-14"},{"$f":"(MENY!F13-MENY!E13-MENY!I13)*MENY!I5","v":"07:30:00"},null,{"$f":"MENY!I13","v":"00:00:00"},"  <-arbeidstid->",null,null,{"$f":"MENY!I14","v":"00:00:00"},{"$f":"(MENY!F14-MENY!E14-MENY!I14)*MENY!I5","v":"07:30:00"},null,null,null,"kommer på jobb (inn) og når du er ferdig (ut)",null,null,null,null,null,null,null,null,null,null,null,null,null,null,null,null,null,"Les her"]
["År ",null,null,null,null,null,null,"Fyll ut i arbeids og fraværskode : 0=ordinær  1=Avspasere  2=Ferie  3=Tjeneste  4=Plussdag  5=Helligdag  6=Perm M/lønn  7=Perm U/lønn  8=Sykemelding  9=Egenmelding 10=Sykt barn 11=Ordinær+ , 12 = plusstid som overtid",null,null,null,null,null,null,null,null,null,"Dersom noe av tiden skal utbetales i overtid, så",null,"Arbeidsdata",null,null,null,null,null,null,null,null,6,7,8,9,10,null,null,"Syke-","Stillings"]
[{"$f":"N3","v":2019},{"$f":"WEEKNUM(A9)+MENY!I12","v":27},"I dag","Fravær pr dag",null,"I dag",null,null,null,null,null,null,null,null,null,null,null,"legg inn antall timer nederst på arket.",null,null,null,null,null,6,7,8,9,10,12,13,14,15,16,null,null,"melding","brøk"]
["DATO","UKENR                               og DAG","Inn","Ut","Inn","Ut","Ordinær","Arbeids og fraværskode",null,"Fravær",0.5,1,1.33,"Balanse","Timer i dag","Merknad ",null,"Huskeliste",null,"Arbeids dag","Avsp","Ferie","Tjeneste","Perm m-lønn","Perm u-lønn","Sykemelding","Egenmelding","Sykt barn","Perm m-lønn","Perm u-lønn","Sykemelding","Egenmelding","Sykt barn","Ordinær arbeidstid","Trekk for matpause","i prosent andel"]
[{"$f":"DATE(MENY!P1,7,1)","v":"2019-07-01"},{"$f":"IF(WEEKDAY(A10,2)=1,WEEKNUM(A9)*-1-MENY!$I$12,IF(WEEKDAY(A9,2)<7,LOOKUP(WEEKDAY(A9,2),MENY!$P$8:$P$14,MENY!$Q$8:$Q$14),\"\"))","v":"Man"},null,null,null,null,{"$f":"IF(H9=11,F9-C9-(E9-D9),IF(B9=\"Lør\",0,IF(H9=4,0,IF(H9=3,IF(T9>0,W9,\"\"),IF(H9=1,0, IF(C9>0,  AH9,       \"\"))))))","v":""},{"$f":"IF(B9=\"Lør\",IF(C9>0,4,0),0)","v":0},{"$f":"IF(H9=11,\"Ordinær +\",IF(T9=1,IF(H9>0,LOOKUP(H9,MENY!$N$2:O18,MENY!$O$2:$O$18),IF(C9>0,IF(B9=\"Lør\",\"-\",\"Ordinær\"),\"-\")),\"Søndag\"))","v":"-"},null,{"$f":"IF(H9=12,IF(N9>=4,4,N9),0)","v":0},{"$f":"IF(H9=12,IF(N9>K9,N9-4,0),0)","v":0},null,{"$f":"IF(H9=11,0,IF(T9=1,IF(H9=4,((F9-C9)-(E9-D9))*24,IF(C9>0,(F9-C9-(E9-D9)-G9-AI9)*24,0)),0))","v":0},{"$f":"IF(F9>0,G9*24+N9,\"\")","v":""},null,null,{"$f":"IF(O9=\"\",\"\",\"Husk, fordel timer til prosjekter\")","v":""},null,{"$f":"IF(WEEKDAY(A9-1)<7,1,0)","v":1},{"$f":"IF(B9=\"Lør\",\"\",IF(T9=1,IF(H9=1,AH9,0),0))","v":"00:00:00"},{"$f":"IF(T9=1,IF(B9=\"lør\",\"\",IF(H9=2,1,0)),\"\")","v":0},{"$f":"IF(T9=1,IF(H9=3,AH9,0),0)","v":"00:00:00"},{"$f":"IF(B9=\"lør\",\"\",IF(T9=1,IF(H9=6,AH9,0),0))","v":"00:00:00"},{"$f":"IF(B9=\"Lør\",\"\",IF(T9=1,IF(H9=7,AH9,0),0))","v":"00:00:00"},{"$f":"IF(AJ9>0,IF(C9>0,    (AH9*AJ9)/(1-AJ9),0),           IF(B9=\"Lør\",\"\",IF(T9=1,IF(H9=8,AH9,0),0)))","v":"00:00:00"},{"$f":"IF(B9=\"Lør\",\"\",IF(T9=1,IF(H9=9,AH9,0),0))","v":"00:00:00"},{"$f":"IF(B9=\"Lør\",\"\",IF(T9=1,IF(H9=10,AH9,0),0))","v":"00:00:00"},{"$f":"IF(J9=6,N9,0)","v":0},{"$f":"IF(J9=7,N9,0)","v":0},{"$f":"IF(J9=8,N9,0)","v":0},{"$f":"IF(J9=9,N9,0)","v":0},{"$f":"IF(J9=10,N9,0)","v":0},{"$f":"((IF(A9<$F$5+1,IF(A9>$E$5-1,$G$5,$N$5),$N$5))*(1-AJ9))*(AK9)","v":"07:30:00"},{"$f":"IF(A9<$F$5+1,IF(A9>$E$5-1,$I$5,$M$5),$M$5)","v":"00:00:00"},{"$f":"JUN!AJ39","v":0},{"$f":"JUN!AK39","v":1}]
[{"$f":"A9+1","v":"2019-07-02"},{"$f":"IF(WEEKDAY(A11,2)=1,WEEKNUM(A10)*-1-MENY!$I$12,IF(WEEKDAY(A10,2)<7,LOOKUP(WEEKDAY(A10,2),MENY!$P$8:$P$14,MENY!$Q$8:$Q$14),\"\"))","v":"Tirs"},null,null,null,null,{"$f":"IF(H10=11,F10-C10-(E10-D10),IF(B10=\"Lør\",0,IF(H10=4,0,IF(H10=3,IF(T10>0,W10,\"\"),IF(H10=1,0, IF(C10>0,  AH10,       \"\"))))))","v":""},0,{"$f":"IF(H10=11,\"Ordinær +\",IF(T10=1,IF(H10>0,LOOKUP(H10,MENY!$N$2:O19,MENY!$O$2:$O$18),IF(C10>0,IF(B10=\"Lør\",\"-\",\"Ordinær\"),\"-\")),\"Søndag\"))","v":"-"},null,{"$f":"IF(H10=12,IF(N10>=4,4,N10),0)","v":0},{"$f":"IF(H10=12,IF(N10>K10,N10-4,0),0)","v":0},null,{"$f":"IF(H10=11,0,IF(T10=1,IF(H10=4,((F10-C10)-(E10-D10))*24,IF(C10>0,(F10-C10-(E10-D10)-G10-AI10)*24,0)),0))","v":0},{"$f":"IF(F10>0,G10*24+N10,\"\")","v":""},null,null,{"$f":"IF(O10=\"\",\"\",\"Husk, fordel timer til prosjekter\")","v":""},null,{"$f":"IF(WEEKDAY(A10-1)<7,1,0)","v":1},{"$f":"IF(B10=\"Lør\",\"\",IF(T10=1,IF(H10=1,AH10,0),0))","v":"00:00:00"},0,{"$f":"IF(T10=1,IF(H10=3,AH10,0),0)","v":"00:00:00"},{"$f":"IF(B10=\"lør\",\"\",IF(T10=1,IF(H10=6,AH10,0),0))","v":"00:00:00"},{"$f":"IF(B10=\"Lør\",\"\",IF(T10=1,IF(H10=7,AH10,0),0))","v":"00:00:00"},{"$f":"IF(AJ10>0,IF(C10>0,    (AH10*AJ10)/(1-AJ10),0),           IF(B10=\"Lør\",\"\",IF(T10=1,IF(H10=8,AH10,0),0)))","v":"00:00:00"},{"$f":"IF(B10=\"Lør\",\"\",IF(T10=1,IF(H10=9,AH10,0),0))","v":"00:00:00"},{"$f":"IF(B10=\"Lør\",\"\",IF(T10=1,IF(H10=10,AH10,0),0))","v":"00:00:00"},0,0,0,0,0,{"$f":"((IF(A10<$F$5+1,IF(A10>$E$5-1,$G$5,$N$5),$N$5))*(1-AJ10))*(AK10)","v":"07:30:00"},{"$f":"IF(A10<$F$5+1,IF(A10>$E$5-1,$I$5,$M$5),$M$5)","v":"00:00:00"},{"$f":"AJ9","v":0},{"$f":"AK9","v":1}]
[{"$f":"A10+1","v":"2019-07-03"},{"$f":"IF(WEEKDAY(A12,2)=1,WEEKNUM(A11)*-1-MENY!$I$12,IF(WEEKDAY(A11,2)<7,LOOKUP(WEEKDAY(A11,2),MENY!$P$8:$P$14,MENY!$Q$8:$Q$14),\"\"))","v":"Ons"},null,null,null,null,{"$f":"IF(H11=11,F11-C11-(E11-D11),IF(B11=\"Lør\",0,IF(H11=4,0,IF(H11=3,IF(T11>0,W11,\"\"),IF(H11=1,0, IF(C11>0,  AH11,       \"\"))))))","v":""},0,{"$f":"IF(H11=11,\"Ordinær +\",IF(T11=1,IF(H11>0,LOOKUP(H11,MENY!$N$2:O20,MENY!$O$2:$O$18),IF(C11>0,IF(B11=\"Lør\",\"-\",\"Ordinær\"),\"-\")),\"Søndag\"))","v":"-"},null,0,0,null,0,"",null,null,"",null,1,"00:00:00",0,"00:00:00","00:00:00","00:00:00","00:00:00","00:00:00","00:00:00",0,0,0,0,0,"07:30:00","00:00:00",{"$f":"AJ10","v":0},{"$f":"AK10","v":1}]
["2019-07-04",{"$f":"IF(WEEKDAY(A13,2)=1,WEEKNUM(A12)*-1-MENY!$I$12,IF(WEEKDAY(A12,2)<7,LOOKUP(WEEKDAY(A12,2),MENY!$P$8:$P$14,MENY!$Q$8:$Q$14),\"\"))","v":"Tors"},null,null,null,null,"",0,{"$f":"IF(H12=11,\"Ordinær +\",IF(T12=1,IF(H12>0,LOOKUP(H12,MENY!$N$2:O21,MENY!$O$2:$O$18),IF(C12>0,IF(B12=\"Lør\",\"-\",\"Ordinær\"),\"-\")),\"Søndag\"))","v":"-"},null,0,0,null,0,"",null,null,"",null,1,"00:00:00",0,"00:00:00","00:00:00","00:00:00","00:00:00","00:00:00","00:00:00",0,0,0,0,0,"07:30:00","00:00:00",0,1]
["2019-07-05",{"$f":"IF(WEEKDAY(A14,2)=1,WEEKNUM(A13)*-1-MENY!$I$12,IF(WEEKDAY(A13,2)<7,LOOKUP(WEEKDAY(A13,2),MENY!$P$8:$P$14,MENY!$Q$8:$Q$14),\"\"))","v":"Fre"},null,null,null,null,"",0,{"$f":"IF(H13=11,\"Ordinær +\",IF(T13=1,IF(H13>0,LOOKUP(H13,MENY!$N$2:O22,MENY!$O$2:$O$18),IF(C13>0,IF(B13=\"Lør\",\"-\",\"Ordinær\"),\"-\")),\"Søndag\"))","v":"-"},null,0,0,null,0,"",null,null,"",null,1,"00:00:00",0,"00:00:00","00:00:00","00:00:00","00:00:00","00:00:00","00:00:00",0,0,0,0,0,"07:30:00","00:00:00",0,1]
["2019-07-06",{"$f":"IF(WEEKDAY(A15,2)=1,WEEKNUM(A14)*-1-MENY!$I$12,IF(WEEKDAY(A14,2)<7,LOOKUP(WEEKDAY(A14,2),MENY!$P$8:$P$14,MENY!$Q$8:$Q$14),\"\"))","v":"Lør"},null,null,null,null,"00:00:00",0,{"$f":"IF(H14=11,\"Ordinær +\",IF(T14=1,IF(H14>0,LOOKUP(H14,MENY!$N$2:O23,MENY!$O$2:$O$18),IF(C14>0,IF(B14=\"Lør\",\"-\",\"Ordinær\"),\"-\")),\"Søndag\"))","v":"-"},null,0,0,null,0,"",null,null,"",null,1,"","","00:00:00","","","","","",0,0,0,0,0,"07:30:00","00:00:00",0,1]
["2019-07-07",{"$f":"IF(WEEKDAY(A16,2)=1,WEEKNUM(A15)*-1-MENY!$I$12,IF(WEEKDAY(A15,2)<7,LOOKUP(WEEKDAY(A15,2),MENY!$P$8:$P$14,MENY!$Q$8:$Q$14),\"\"))","v":-28},null,null,null,null,"",0,{"$f":"IF(H15=11,\"Ordinær +\",IF(T15=1,IF(H15>0,LOOKUP(H15,MENY!$N$2:O24,MENY!$O$2:$O$18),IF(C15>0,IF(B15=\"Lør\",\"-\",\"Ordinær\"),\"-\")),\"Søndag\"))","v":"Søndag"},null,0,0,null,0,"",null,null,"",null,0,"00:00:00","","00:00:00","00:00:00","00:00:00","00:00:00","00:00:00","00:00:00",0,0,0,0,0,"07:30:00","00:00:00",0,1]
["2019-07-08",{"$f":"IF(WEEKDAY(A17,2)=1,WEEKNUM(A16)*-1-MENY!$I$12,IF(WEEKDAY(A16,2)<7,LOOKUP(WEEKDAY(A16,2),MENY!$P$8:$P$14,MENY!$Q$8:$Q$14),\"\"))","v":"Man"},null,null,null,null,"",0,{"$f":"IF(H16=11,\"Ordinær +\",IF(T16=1,IF(H16>0,LOOKUP(H16,MENY!$N$2:O25,MENY!$O$2:$O$18),IF(C16>0,IF(B16=\"Lør\",\"-\",\"Ordinær\"),\"-\")),\"Søndag\"))","v":"-"},null,0,0,null,0,"",null,null,"",null,1,"00:00:00",0,"00:00:00","00:00:00","00:00:00","00:00:00","00:00:00","00:00:00",0,0,0,0,0,"07:30:00","00:00:00",0,1]
["2019-07-09",{"$f":"IF(WEEKDAY(A18,2)=1,WEEKNUM(A17)*-1-MENY!$I$12,IF(WEEKDAY(A17,2)<7,LOOKUP(WEEKDAY(A17,2),MENY!$P$8:$P$14,MENY!$Q$8:$Q$14),\"\"))","v":"Tirs"},null,null,null,null,"",0,{"$f":"IF(H17=11,\"Ordinær +\",IF(T17=1,IF(H17>0,LOOKUP(H17,MENY!$N$2:O26,MENY!$O$2:$O$18),IF(C17>0,IF(B17=\"Lør\",\"-\",\"Ordinær\"),\"-\")),\"Søndag\"))","v":"-"},null,0,0,null,0,"",null,null,"",null,1,"00:00:00",0,"00:00:00","00:00:00","00:00:00","00:00:00","00:00:00","00:00:00",0,0,0,0,0,"07:30:00","00:00:00",0,1]
["2019-07-10",{"$f":"IF(WEEKDAY(A19,2)=1,WEEKNUM(A18)*-1-MENY!$I$12,IF(WEEKDAY(A18,2)<7,LOOKUP(WEEKDAY(A18,2),MENY!$P$8:$P$14,MENY!$Q$8:$Q$14),\"\"))","v":"Ons"},null,null,null,null,"",0,{"$f":"IF(H18=11,\"Ordinær +\",IF(T18=1,IF(H18>0,LOOKUP(H18,MENY!$N$2:O27,MENY!$O$2:$O$18),IF(C18>0,IF(B18=\"Lør\",\"-\",\"Ordinær\"),\"-\")),\"Søndag\"))","v":"-"},null,0,0,null,0,"",null,null,"",null,1,"00:00:00",0,"00:00:00","00:00:00","00:00:00","00:00:00","00:00:00","00:00:00",0,0,0,0,0,"07:30:00","00:00:00",0,1]
["2019-07-11",{"$f":"IF(WEEKDAY(A20,2)=1,WEEKNUM(A19)*-1-MENY!$I$12,IF(WEEKDAY(A19,2)<7,LOOKUP(WEEKDAY(A19,2),MENY!$P$8:$P$14,MENY!$Q$8:$Q$14),\"\"))","v":"Tors"},null,null,null,null,"",0,{"$f":"IF(H19=11,\"Ordinær +\",IF(T19=1,IF(H19>0,LOOKUP(H19,MENY!$N$2:O28,MENY!$O$2:$O$18),IF(C19>0,IF(B19=\"Lør\",\"-\",\"Ordinær\"),\"-\")),\"Søndag\"))","v":"-"},null,0,0,null,0,"",null,null,"",null,1,"00:00:00",0,"00:00:00","00:00:00","00:00:00","00:00:00","00:00:00","00:00:00",0,0,0,0,0,"07:30:00","00:00:00",0,1]
["2019-07-12",{"$f":"IF(WEEKDAY(A21,2)=1,WEEKNUM(A20)*-1-MENY!$I$12,IF(WEEKDAY(A20,2)<7,LOOKUP(WEEKDAY(A20,2),MENY!$P$8:$P$14,MENY!$Q$8:$Q$14),\"\"))","v":"Fre"},null,null,null,null,"",0,{"$f":"IF(H20=11,\"Ordinær +\",IF(T20=1,IF(H20>0,LOOKUP(H20,MENY!$N$2:O29,MENY!$O$2:$O$18),IF(C20>0,IF(B20=\"Lør\",\"-\",\"Ordinær\"),\"-\")),\"Søndag\"))","v":"-"},null,0,0,null,0,"",null,null,"",null,1,"00:00:00",0,"00:00:00","00:00:00","00:00:00","00:00:00","00:00:00","00:00:00",0,0,0,0,0,"07:30:00","00:00:00",0,1]
["2019-07-13",{"$f":"IF(WEEKDAY(A22,2)=1,WEEKNUM(A21)*-1-MENY!$I$12,IF(WEEKDAY(A21,2)<7,LOOKUP(WEEKDAY(A21,2),MENY!$P$8:$P$14,MENY!$Q$8:$Q$14),\"\"))","v":"Lør"},null,null,null,null,"00:00:00",0,{"$f":"IF(H21=11,\"Ordinær +\",IF(T21=1,IF(H21>0,LOOKUP(H21,MENY!$N$2:O30,MENY!$O$2:$O$18),IF(C21>0,IF(B21=\"Lør\",\"-\",\"Ordinær\"),\"-\")),\"Søndag\"))","v":"-"},null,0,0,null,0,"",null,null,"",null,1,"","","00:00:00","","","","","",0,0,0,0,0,"07:30:00","00:00:00",0,1]
["2019-07-14",{"$f":"IF(WEEKDAY(A23,2)=1,WEEKNUM(A22)*-1-MENY!$I$12,IF(WEEKDAY(A22,2)<7,LOOKUP(WEEKDAY(A22,2),MENY!$P$8:$P$14,MENY!$Q$8:$Q$14),\"\"))","v":-29},null,null,null,null,"",0,{"$f":"IF(H22=11,\"Ordinær +\",IF(T22=1,IF(H22>0,LOOKUP(H22,MENY!$N$2:O31,MENY!$O$2:$O$18),IF(C22>0,IF(B22=\"Lør\",\"-\",\"Ordinær\"),\"-\")),\"Søndag\"))","v":"Søndag"},null,0,0,null,0,"",null,null,"",null,0,"00:00:00","","00:00:00","00:00:00","00:00:00","00:00:00","00:00:00","00:00:00",0,0,0,0,0,"07:30:00","00:00:00",0,1]
["2019-07-15",{"$f":"IF(WEEKDAY(A24,2)=1,WEEKNUM(A23)*-1-MENY!$I$12,IF(WEEKDAY(A23,2)<7,LOOKUP(WEEKDAY(A23,2),MENY!$P$8:$P$14,MENY!$Q$8:$Q$14),\"\"))","v":"Man"},null,null,null,null,"",0,{"$f":"IF(H23=11,\"Ordinær +\",IF(T23=1,IF(H23>0,LOOKUP(H23,MENY!$N$2:O32,MENY!$O$2:$O$18),IF(C23>0,IF(B23=\"Lør\",\"-\",\"Ordinær\"),\"-\")),\"Søndag\"))","v":"-"},null,0,0,null,0,"",null,null,"",null,1,"00:00:00",0,"00:00:00","00:00:00","00:00:00","00:00:00","00:00:00","00:00:00",0,0,0,0,0,"07:30:00","00:00:00",0,1]
["2019-07-16",{"$f":"IF(WEEKDAY(A25,2)=1,WEEKNUM(A24)*-1-MENY!$I$12,IF(WEEKDAY(A24,2)<7,LOOKUP(WEEKDAY(A24,2),MENY!$P$8:$P$14,MENY!$Q$8:$Q$14),\"\"))","v":"Tirs"},null,null,null,null,"",0,{"$f":"IF(H24=11,\"Ordinær +\",IF(T24=1,IF(H24>0,LOOKUP(H24,MENY!$N$2:O33,MENY!$O$2:$O$18),IF(C24>0,IF(B24=\"Lør\",\"-\",\"Ordinær\"),\"-\")),\"Søndag\"))","v":"-"},null,0,0,null,0,"",null,null,"",null,1,"00:00:00",0,"00:00:00","00:00:00","00:00:00","00:00:00","00:00:00","00:00:00",0,0,0,0,0,"07:30:00","00:00:00",0,1]
["2019-07-17",{"$f":"IF(WEEKDAY(A26,2)=1,WEEKNUM(A25)*-1-MENY!$I$12,IF(WEEKDAY(A25,2)<7,LOOKUP(WEEKDAY(A25,2),MENY!$P$8:$P$14,MENY!$Q$8:$Q$14),\"\"))","v":"Ons"},null,null,null,null,"",0,{"$f":"IF(H25=11,\"Ordinær +\",IF(T25=1,IF(H25>0,LOOKUP(H25,MENY!$N$2:O34,MENY!$O$2:$O$18),IF(C25>0,IF(B25=\"Lør\",\"-\",\"Ordinær\"),\"-\")),\"Søndag\"))","v":"-"},null,0,0,null,0,"",null,null,"",null,1,"00:00:00",0,"00:00:00","00:00:00","00:00:00","00:00:00","00:00:00","00:00:00",0,0,0,0,0,"07:30:00","00:00:00",0,1]
["2019-07-18",{"$f":"IF(WEEKDAY(A27,2)=1,WEEKNUM(A26)*-1-MENY!$I$12,IF(WEEKDAY(A26,2)<7,LOOKUP(WEEKDAY(A26,2),MENY!$P$8:$P$14,MENY!$Q$8:$Q$14),\"\"))","v":"Tors"},null,null,null,null,"",0,{"$f":"IF(H26=11,\"Ordinær +\",IF(T26=1,IF(H26>0,LOOKUP(H26,MENY!$N$2:O35,MENY!$O$2:$O$18),IF(C26>0,IF(B26=\"Lør\",\"-\",\"Ordinær\"),\"-\")),\"Søndag\"))","v":"-"},null,0,0,null,0,"",null,null,"",null,1,"00:00:00",0,"00:00:00","00:00:00","00:00:00","00:00:00","00:00:00","00:00:00",0,0,0,0,0,"07:30:00","00:00:00",0,1]
["2019-07-19",{"$f":"IF(WEEKDAY(A28,2)=1,WEEKNUM(A27)*-1-MENY!$I$12,IF(WEEKDAY(A27,2)<7,LOOKUP(WEEKDAY(A27,2),MENY!$P$8:$P$14,MENY!$Q$8:$Q$14),\"\"))","v":"Fre"},null,null,null,null,"",0,{"$f":"IF(H27=11,\"Ordinær +\",IF(T27=1,IF(H27>0,LOOKUP(H27,MENY!$N$2:O36,MENY!$O$2:$O$18),IF(C27>0,IF(B27=\"Lør\",\"-\",\"Ordinær\"),\"-\")),\"Søndag\"))","v":"-"},null,0,0,null,0,"",null,null,"",null,1,"00:00:00",0,"00:00:00","00:00:00","00:00:00","00:00:00","00:00:00","00:00:00",0,0,0,0,0,"07:30:00","00:00:00",0,1]
["2019-07-20",{"$f":"IF(WEEKDAY(A29,2)=1,WEEKNUM(A28)*-1-MENY!$I$12,IF(WEEKDAY(A28,2)<7,LOOKUP(WEEKDAY(A28,2),MENY!$P$8:$P$14,MENY!$Q$8:$Q$14),\"\"))","v":"Lør"},null,null,null,null,"00:00:00",0,{"$f":"IF(H28=11,\"Ordinær +\",IF(T28=1,IF(H28>0,LOOKUP(H28,MENY!$N$2:O37,MENY!$O$2:$O$18),IF(C28>0,IF(B28=\"Lør\",\"-\",\"Ordinær\"),\"-\")),\"Søndag\"))","v":"-"},null,0,0,null,0,"",null,null,"",null,1,"","","00:00:00","","","","","",0,0,0,0,0,"07:30:00","00:00:00",0,1]
["2019-07-21",{"$f":"IF(WEEKDAY(A30,2)=1,WEEKNUM(A29)*-1-MENY!$I$12,IF(WEEKDAY(A29,2)<7,LOOKUP(WEEKDAY(A29,2),MENY!$P$8:$P$14,MENY!$Q$8:$Q$14),\"\"))","v":-30},null,null,null,null,"",0,{"$f":"IF(H29=11,\"Ordinær +\",IF(T29=1,IF(H29>0,LOOKUP(H29,MENY!$N$2:O38,MENY!$O$2:$O$18),IF(C29>0,IF(B29=\"Lør\",\"-\",\"Ordinær\"),\"-\")),\"Søndag\"))","v":"Søndag"},null,0,0,null,0,"",null,null,"",null,0,"00:00:00","","00:00:00","00:00:00","00:00:00","00:00:00","00:00:00","00:00:00",0,0,0,0,0,"07:30:00","00:00:00",0,1]
["2019-07-22",{"$f":"IF(WEEKDAY(A31,2)=1,WEEKNUM(A30)*-1-MENY!$I$12,IF(WEEKDAY(A30,2)<7,LOOKUP(WEEKDAY(A30,2),MENY!$P$8:$P$14,MENY!$Q$8:$Q$14),\"\"))","v":"Man"},null,null,null,null,"",0,{"$f":"IF(H30=11,\"Ordinær +\",IF(T30=1,IF(H30>0,LOOKUP(H30,MENY!$N$2:O39,MENY!$O$2:$O$18),IF(C30>0,IF(B30=\"Lør\",\"-\",\"Ordinær\"),\"-\")),\"Søndag\"))","v":"-"},null,0,0,null,0,"",null,null,"",null,1,"00:00:00",0,"00:00:00","00:00:00","00:00:00","00:00:00","00:00:00","00:00:00",0,0,0,0,0,"07:30:00","00:00:00",0,1]
["2019-07-23",{"$f":"IF(WEEKDAY(A32,2)=1,WEEKNUM(A31)*-1-MENY!$I$12,IF(WEEKDAY(A31,2)<7,LOOKUP(WEEKDAY(A31,2),MENY!$P$8:$P$14,MENY!$Q$8:$Q$14),\"\"))","v":"Tirs"},null,null,null,null,"",0,{"$f":"IF(H31=11,\"Ordinær +\",IF(T31=1,IF(H31>0,LOOKUP(H31,MENY!$N$2:O40,MENY!$O$2:$O$18),IF(C31>0,IF(B31=\"Lør\",\"-\",\"Ordinær\"),\"-\")),\"Søndag\"))","v":"-"},null,0,0,null,0,"",null,null,"",null,1,"00:00:00",0,"00:00:00","00:00:00","00:00:00","00:00:00","00:00:00","00:00:00",0,0,0,0,0,"07:30:00","00:00:00",0,1]
["2019-07-24",{"$f":"IF(WEEKDAY(A33,2)=1,WEEKNUM(A32)*-1-MENY!$I$12,IF(WEEKDAY(A32,2)<7,LOOKUP(WEEKDAY(A32,2),MENY!$P$8:$P$14,MENY!$Q$8:$Q$14),\"\"))","v":"Ons"},null,null,null,null,"",0,{"$f":"IF(H32=11,\"Ordinær +\",IF(T32=1,IF(H32>0,LOOKUP(H32,MENY!$N$2:O41,MENY!$O$2:$O$18),IF(C32>0,IF(B32=\"Lør\",\"-\",\"Ordinær\"),\"-\")),\"Søndag\"))","v":"-"},null,0,0,null,0,"",null,null,"",null,1,"00:00:00",0,"00:00:00","00:00:00","00:00:00","00:00:00","00:00:00","00:00:00",0,0,0,0,0,"07:30:00","00:00:00",0,1]
["2019-07-25",{"$f":"IF(WEEKDAY(A34,2)=1,WEEKNUM(A33)*-1-MENY!$I$12,IF(WEEKDAY(A33,2)<7,LOOKUP(WEEKDAY(A33,2),MENY!$P$8:$P$14,MENY!$Q$8:$Q$14),\"\"))","v":"Tors"},null,null,null,null,"",0,{"$f":"IF(H33=11,\"Ordinær +\",IF(T33=1,IF(H33>0,LOOKUP(H33,MENY!$N$2:O42,MENY!$O$2:$O$18),IF(C33>0,IF(B33=\"Lør\",\"-\",\"Ordinær\"),\"-\")),\"Søndag\"))","v":"-"},null,0,0,null,0,"",null,null,"",null,1,"00:00:00",0,"00:00:00","00:00:00","00:00:00","00:00:00","00:00:00","00:00:00",0,0,0,0,0,"07:30:00","00:00:00",0,1]
["2019-07-26",{"$f":"IF(WEEKDAY(A35,2)=1,WEEKNUM(A34)*-1-MENY!$I$12,IF(WEEKDAY(A34,2)<7,LOOKUP(WEEKDAY(A34,2),MENY!$P$8:$P$14,MENY!$Q$8:$Q$14),\"\"))","v":"Fre"},null,null,null,null,"",0,{"$f":"IF(H34=11,\"Ordinær +\",IF(T34=1,IF(H34>0,LOOKUP(H34,MENY!$N$2:O43,MENY!$O$2:$O$18),IF(C34>0,IF(B34=\"Lør\",\"-\",\"Ordinær\"),\"-\")),\"Søndag\"))","v":"-"},null,0,0,null,0,"",null,null,"",null,1,"00:00:00",0,"00:00:00","00:00:00","00:00:00","00:00:00","00:00:00","00:00:00",0,0,0,0,0,"07:30:00","00:00:00",0,1]
["2019-07-27",{"$f":"IF(WEEKDAY(A36,2)=1,WEEKNUM(A35)*-1-MENY!$I$12,IF(WEEKDAY(A35,2)<7,LOOKUP(WEEKDAY(A35,2),MENY!$P$8:$P$14,MENY!$Q$8:$Q$14),\"\"))","v":"Lør"},null,null,null,null,"00:00:00",0,{"$f":"IF(H35=11,\"Ordinær +\",IF(T35=1,IF(H35>0,LOOKUP(H35,MENY!$N$2:O44,MENY!$O$2:$O$18),IF(C35>0,IF(B35=\"Lør\",\"-\",\"Ordinær\"),\"-\")),\"Søndag\"))","v":"-"},null,0,0,null,0,"",null,null,"",null,{"$f":"IF(A35>0,IF(WEEKDAY(A35-1)<7,1,0),\"\")","v":1},"","","00:00:00","","","","","",0,0,0,0,0,"07:30:00","00:00:00",0,1]
["2019-07-28",{"$f":"IF(WEEKDAY(A37,2)=1,WEEKNUM(A36)*-1-MENY!$I$12,IF(WEEKDAY(A36,2)<7,LOOKUP(WEEKDAY(A36,2),MENY!$P$8:$P$14,MENY!$Q$8:$Q$14),\"\"))","v":-31},null,null,null,null,"",0,{"$f":"IF(H36=11,\"Ordinær +\",IF(T36=1,IF(H36>0,LOOKUP(H36,MENY!$N$2:O45,MENY!$O$2:$O$18),IF(C36>0,IF(B36=\"Lør\",\"-\",\"Ordinær\"),\"-\")),\"Søndag\"))","v":"Søndag"},null,0,0,null,0,"",null,null,"",null,{"$f":"IF(A36>0,IF(WEEKDAY(A36-1)<7,1,0),\"\")","v":0},"00:00:00","","00:00:00","00:00:00","00:00:00","00:00:00","00:00:00","00:00:00",0,0,0,0,0,"07:30:00","00:00:00",0,1]
["2019-07-29",{"$f":"IF(WEEKDAY(A38,2)=1,WEEKNUM(A37)*-1-MENY!$I$12,IF(WEEKDAY(A37,2)<7,LOOKUP(WEEKDAY(A37,2),MENY!$P$8:$P$14,MENY!$Q$8:$Q$14),\"\"))","v":"Man"},null,null,null,null,"",0,{"$f":"IF(H37=11,\"Ordinær +\",IF(T37=1,IF(H37>0,LOOKUP(H37,MENY!$N$2:O46,MENY!$O$2:$O$18),IF(C37>0,IF(B37=\"Lør\",\"-\",\"Ordinær\"),\"-\")),\"Søndag\"))","v":"-"},null,0,0,null,0,"",null,null,"",null,{"$f":"IF(A37>0,IF(WEEKDAY(A37-1)<7,1,0),\"\")","v":1},"00:00:00",0,"00:00:00","00:00:00","00:00:00","00:00:00","00:00:00","00:00:00",0,0,0,0,0,"07:30:00","00:00:00",0,1]
["2019-07-30",{"$f":"IF(WEEKDAY(A39,2)=1,WEEKNUM(A38)*-1-MENY!$I$12,IF(WEEKDAY(A38,2)<7,LOOKUP(WEEKDAY(A38,2),MENY!$P$8:$P$14,MENY!$Q$8:$Q$14),\"\"))","v":"Tirs"},null,null,null,null,"",0,{"$f":"IF(H38=11,\"Ordinær +\",IF(T38=1,IF(H38>0,LOOKUP(H38,MENY!$N$2:O47,MENY!$O$2:$O$18),IF(C38>0,IF(B38=\"Lør\",\"-\",\"Ordinær\"),\"-\")),\"Søndag\"))","v":"-"},null,0,0,null,0,"",null,null,"",null,{"$f":"IF(A38>0,IF(WEEKDAY(A38-1)<7,1,0),\"\")","v":1},"00:00:00",0,"00:00:00","00:00:00","00:00:00","00:00:00","00:00:00","00:00:00",0,0,0,0,0,"07:30:00","00:00:00",0,1]
["2019-07-31",{"$f":"IF(WEEKDAY(A40,2)=1,WEEKNUM(A39)*-1-MENY!$I$12,IF(WEEKDAY(A39,2)<7,LOOKUP(WEEKDAY(A39,2),MENY!$P$8:$P$14,MENY!$Q$8:$Q$14),\"\"))","v":"Ons"},null,null,null,null,"",0,{"$f":"IF(H39=11,\"Ordinær +\",IF(T39=1,IF(H39>0,LOOKUP(H39,MENY!$N$2:O48,MENY!$O$2:$O$18),IF(C39>0,IF(B39=\"Lør\",\"-\",\"Ordinær\"),\"-\")),\"Søndag\"))","v":"-"},null,0,0,null,0,"",null,null,"",null,{"$f":"IF(A39>0,IF(WEEKDAY(A39-1)<7,1,0),\"\")","v":1},"00:00:00",0,"00:00:00","00:00:00","00:00:00","00:00:00",{"$f":"IF(B39=\"Lør\",\"\",IF(T39=1,IF(H39=9,AH39,0),0))","v":"00:00:00"},"00:00:00",0,0,0,0,0,"07:30:00","00:00:00",0,1]
[null,null,null,"Sum for denne måned",null,null,{"$f":"SUM(G9:G39)*24","v":0},null,null,null,{"$f":"SUM(K9:K39)+N49","v":0},{"$f":"SUM(L9:L39)","v":0},{"$f":"SUM(M9:M39)","v":0},{"$f":"SUM(N9:N39)-U40-AG41-SUM(K40:M40)+N50","v":0},{"$f":"SUM(O9:O39)","v":0},"Fravær denne måned",null,null,null,null,{"$f":"SUM(U9:U39)*24","v":0},{"$f":"SUM(V9:V39)","v":0},{"$f":"SUM(W9:W39)*24","v":0},0,0,0,0,0,{"$f":"SUM(AC9:AC39)","v":0},{"$f":"SUM(AD9:AD39)","v":0},{"$f":"SUM(AE9:AE39)","v":0},{"$f":"SUM(AF9:AF39)","v":0},{"$f":"SUM(AG9:AG39)","v":0}]
[null,null,null,"Overført fra forrige måned",null,null,null,null,null,null,null,null,null,{"$f":"JUN!N47","v":0},{"$f":"JUN!O42","v":0},"Type","Timer",null,null,null,null,null,null,null,null,null,null,null,null,null,null,"Sum deltidsfravær:",{"$f":"SUM(AC40:AG40)","v":0}]
[null,null,null,"Sum hittil i år",null,null,null,null,null,null,null,null,null,{"$f":"SUM(N40:N41)","v":0},{"$f":"SUM(O40:O41)","v":0},"06 Perm m/lønn",{"$f":"X40+AC40*-1","v":0}]
["Ferieregnskap",null,null,"Dager","Timeregnskap",null,null,null,null,null,null,null,null,"Timer",null,"07 Perm u/lønn",{"$f":"Y40+AD40*-1","v":0}]
["Disponible feriedager",null,null,{"$f":"JUN!D47","v":25},"Opptjent denne måneden",null,null,null,null,null,null,null,null,{"$f":"SUM(N9:N39)-AG41-(SUM(K40:M40))+N50","v":0},null,"08 Sykemelding",{"$f":"(Z40+AE40*-1)","v":0}]
["Brukt denne måned",null,null,{"$f":"V40*-1","v":0},"Avspasert denne måneden",null,null,null,null,null,null,null,null,{"$f":"U40","v":0},null,"09 Egenmelding",{"$f":"(AA40+AF40*-1)","v":0}]
["Endring i feriedager",null,null,null,"Utbetalt overtid denne måned",null,null,null,null,null,null,null,null,{"$f":"SUM(K40:M40)","v":0},null,"10 Sykt barn",{"$f":"(AB40+AG40*-1)","v":0}]
["Til gode",null,null,{"$f":"SUM(D44:D46)","v":25},"Til gode for avspasering",null,null,null,null,null,null,null,null,{"$f":"N42","v":0},null,"Sum - Juli",{"$f":"SUM(Q42:Q46)","v":0}]
[null,null,null,null,"Effektiv arbeidstid denne måned",null,null,null,null,null,null,null,null,{"$f":"G40+N44+AG41+N46-N50","v":0},null,"Hittil i år",{"$f":"Q47+JUN!Q48","v":0}]
[null,null,null,null,"Flexitid omgjort til overtid og utbetalt, denne måned"]
[null,null,null,null,"Annen korrigering av flexitid, OBS! skriv egen merknad"]
["Merknader"]
[]
[]
[]
[]
[]
["Overtid for utbetaling:",null,null,null,null,null,"Dato",null,null,null,null,null,null,null,"Dato"]
[null,null,null,"Timer med 50% tillegg :",{"$f":"K40","v":0}]
[null,null,null,"Timer med 100% tillegg:",{"$f":"L40","v":0}]
[null,null,null,"Timer med 133% tillegg:",{"$f":"M39","v":0},null,null,null,"Attestert",null,null,null,null,null,"Anvist"]
[]
[]
[null,null,null,null,null,null,null,null,null,null,null,null,null,null,null,{"$f":"MENY!D6","v":"Leder"}]
["© Ole Jørgen Klaussen - 2003",null,null,null,{"$f":"TODAY()","v":"2018-11-30"},{"$f":"YEAR(TODAY())","v":2018},null,null,null,null,null,null,null,null,null,null,"ole.klaussen@online.no"]

{"sheet":"AUG","index":8,"n_rows":64,"n_cols":37,"rows_kept":64,"cut":false,"hidden":false,"merged":[[5,19,5,22],[6,3,6,4],[7,7,7,8],[5,7,6,16],[15,15,15,16],[2,1,2,6],[8,15,8,16],[9,15,9,16],[10,15,10,16],[7,15,7,16],[23,15,23,16],[17,15,17,16],[11,15,11,16],[12,15,12,16],[13,15,13,16],[14,15,14,16],[16,15,16,16],[18,15,18,16],[19,15,19,16],[20,15,20,16],[21,15,21,16],[22,15,22,16],[30,15,30,16],[31,15,31,16],[32,15,32,16],[33,15,33,16],[24,15,24,16],[25,15,25,16],[26,15,26,16],[27,15,27,16],[28,15,28,16],[29,15,29,16],[1,28,2,33],[59,14,59,16],[62,6,62,10],[55,0,55,16],[56,6,56,10],[56,14,56,16],[51,0,51,16],[52,0,52,16],[53,0,53,16],[54,0,54,16],[38,15,38,16],[2,15,2,16],[34,15,34,16],[35,15,35,16],[36,15,36,16],[37,15,37,16]]}
["Meny","JAN","FEB","MAR","APR","MAI","JUN",null,null,null,null,null,null,null,null,null,"Hjelp","Viktig når det gjelder overtid"]
["Året","JUL","AUG","SEP","OKT","NOV","DES",null,null,null,null,null,null,null,null,"Dato",null,"For at føringer av aktiv arbeidstid skal bli riktig"]
[null,{"$f":"MENY!D4","v":"Min bedrift"},null,null,null,null,null,null,"August -",null,null,null,null,{"$f":"MENY!P1","v":2019},null,{"$f":"TODAY()","v":"2018-11-30"},null,"er det nødvendig at all arbeidstid registreres."]
[null,"Timeliste","Navn:",{"$f":"MENY!D5","v":"Min timeliste"},null,null,"Sommer",null,null,null,"Stillingsbrøk:",{"$f":"MENY!I5","v":1},null,"Vinter",null,null,null,"Dette gjelder også overtid. Så registrer  når du ",null,null,null,null,null,null,null,null,null,null,null,null,null,null,null,null,null,"MERK!"]
[null,null,"Sommerlukking fra/til:",null,{"$f":"MENY!Q18","v":"2019-05-15"},{"$f":"MENY!Q19","v":"2019-09-14"},{"$f":"(MENY!F13-MENY!E13-MENY!I13)*MENY!I5","v":"07:30:00"},null,{"$f":"MENY!I13","v":"00:00:00"},"  <-arbeidstid->",null,null,{"$f":"MENY!I14","v":"00:00:00"},{"$f":"(MENY!F14-MENY!E14-MENY!I14)*MENY!I5","v":"07:30:00"},null,null,null,"kommer på jobb (inn) og når du er ferdig (ut)",null,null,null,null,null,null,null,null,null,null,null,null,null,null,null,null,null,"Les her"]
["År ",null,null,null,null,null,null,"Fyll ut i arbeids og fraværskode : 0=ordinær  1=Avspasere  2=Ferie  3=Tjeneste  4=Plussdag  5=Helligdag  6=Perm M/lønn  7=Perm U/lønn  8=Sykemelding  9=Egenmelding 10=Sykt barn 11=Ordinær+ , 12 = plusstid som overtid",null,null,null,null,null,null,null,null,null,"Dersom noe av tiden skal utbetales i overtid, så",null,"Arbeidsdata",null,null,null,null,null,null,null,null,6,7,8,9,10,null,null,"Syke-","Stillings"]
[{"$f":"N3","v":2019},{"$f":"WEEKNUM(A9)+MENY!I12","v":31},"I dag","Fravær pr dag",null,"I dag",null,null,null,null,null,null,null,null,null,null,null,"legg inn antall timer nederst på arket.",null,null,null,null,null,6,7,8,9,10,12,13,14,15,16,null,null,"melding","brøk"]
["DATO","UKENR                               og DAG","Inn","Ut","Inn","Ut","Ordinær","Arbeids og fraværskode",null,"Fravær",0.5,1,1.33,"Balanse","Timer i dag","Merknad ",null,"Huskeliste",null,"Arbeids dag","Avsp","Ferie","Tjeneste","Perm m-lønn","Perm u-lønn","Sykemelding","Egenmelding","Sykt barn","Perm m-lønn","Perm u-lønn","Sykemelding","Egenmelding","Sykt barn","Ordinær arbeidstid","Trekk for matpause","i prosent andel"]
[{"$f":"DATE(MENY!P1,8,1)","v":"2019-08-01"},{"$f":"IF(WEEKDAY(A10,2)=1,WEEKNUM(A9)*-1-MENY!$I$12,IF(WEEKDAY(A9,2)<7,LOOKUP(WEEKDAY(A9,2),MENY!$P$8:$P$14,MENY!$Q$8:$Q$14),\"\"))","v":"Tors"},null,null,null,null,{"$f":"IF(H9=11,F9-C9-(E9-D9),IF(B9=\"Lør\",0,IF(H9=4,0,IF(H9=3,IF(T9>0,W9,\"\"),IF(H9=1,0, IF(C9>0,  AH9,       \"\"))))))","v":""},{"$f":"IF(B9=\"Lør\",IF(C9>0,4,0),0)","v":0},{"$f":"IF(H9=11,\"Ordinær +\",IF(T9=1,IF(H9>0,LOOKUP(H9,MENY!$N$2:O18,MENY!$O$2:$O$18),IF(C9>0,IF(B9=\"Lør\",\"-\",\"Ordinær\"),\"-\")),\"Søndag\"))","v":"-"},null,{"$f":"IF(H9=12,IF(N9>=4,4,N9),0)","v":0},{"$f":"IF(H9=12,IF(N9>K9,N9-4,0),0)","v":0},null,{"$f":"IF(H9=11,0,IF(T9=1,IF(H9=4,((F9-C9)-(E9-D9))*24,IF(C9>0,(F9-C9-(E9-D9)-G9-AI9)*24,0)),0))","v":0},{"$f":"IF(F9>0,G9*24+N9,\"\")","v":""},null,null,{"$f":"IF(O9=\"\",\"\",\"Husk, fordel timer til prosjekter\")","v":""},null,{"$f":"IF(WEEKDAY(A9-1)<7,1,0)","v":1},{"$f":"IF(B9=\"Lør\",\"\",IF(T9=1,IF(H9=1,AH9,0),0))","v":"00:00:00"},{"$f":"IF(T9=1,IF(B9=\"lør\",\"\",IF(H9=2,1,0)),\"\")","v":0},{"$f":"IF(T9=1,IF(H9=3,AH9,0),0)","v":"00:00:00"},{"$f":"IF(B9=\"lør\",\"\",IF(T9=1,IF(H9=6,AH9,0),0))","v":"00:00:00"},{"$f":"IF(B9=\"Lør\",\"\",IF(T9=1,IF(H9=7,AH9,0),0))","v":"00:00:00"},{"$f":"IF(AJ9>0,IF(C9>0,    (AH9*AJ9)/(1-AJ9),0),           IF(B9=\"Lør\",\"\",IF(T9=1,IF(H9=8,AH9,0),0)))","v":"00:00:00"},{"$f":"IF(B9=\"Lør\",\"\",IF(T9=1,IF(H9=9,AH9,0),0))","v":"00:00:00"},{"$f":"IF(B9=\"Lør\",\"\",IF(T9=1,IF(H9=10,AH9,0),0))","v":"00:00:00"},{"$f":"IF(J9=6,N9,0)","v":0},{"$f":"IF(J9=7,N9,0)","v":0},{"$f":"IF(J9=8,N9,0)","v":0},{"$f":"IF(J9=9,N9,0)","v":0},{"$f":"IF(J9=10,N9,0)","v":0},{"$f":"((IF(A9<$F$5+1,IF(A9>$E$5-1,$G$5,$N$5),$N$5))*(1-AJ9))*(AK9)","v":"07:30:00"},{"$f":"IF(A9<$F$5+1,IF(A9>$E$5-1,$I$5,$M$5),$M$5)","v":"00:00:00"},{"$f":"JUL!AJ39","v":0},{"$f":"JUL!AK39","v":1}]
[{"$f":"A9+1","v":"2019-08-02"},{"$f":"IF(WEEKDAY(A11,2)=1,WEEKNUM(A10)*-1-MENY!$I$12,IF(WEEKDAY(A10,2)<7,LOOKUP(WEEKDAY(A10,2),MENY!$P$8:$P$14,MENY!$Q$8:$Q$14),\"\"))","v":"Fre"},null,null,null,null,{"$f":"IF(H10=11,F10-C10-(E10-D10),IF(B10=\"Lør\",0,IF(H10=4,0,IF(H10=3,IF(T10>0,W10,\"\"),IF(H10=1,0, IF(C10>0,  AH10,       \"\"))))))","v":""},0,{"$f":"IF(H10=11,\"Ordinær +\",IF(T10=1,IF(H10>0,LOOKUP(H10,MENY!$N$2:O19,MENY!$O$2:$O$18),IF(C10>0,IF(B10=\"Lør\",\"-\",\"Ordinær\"),\"-\")),\"Søndag\"))","v":"-"},null,{"$f":"IF(H10=12,IF(N10>=4,4,N10),0)","v":0},{"$f":"IF(H10=12,IF(N10>K10,N10-4,0),0)","v":0},null,{"$f":"IF(H10=11,0,IF(T10=1,IF(H10=4,((F10-C10)-(E10-D10))*24,IF(C10>0,(F10-C10-(E10-D10)-G10-AI10)*24,0)),0))","v":0},{"$f":"IF(F10>0,G10*24+N10,\"\")","v":""},null,null,{"$f":"IF(O10=\"\",\"\",\"Husk, fordel timer til prosjekter\")","v":""},null,{"$f":"IF(WEEKDAY(A10-1)<7,1,0)","v":1},{"$f":"IF(B10=\"Lør\",\"\",IF(T10=1,IF(H10=1,AH10,0),0))","v":"00:00:00"},0,{"$f":"IF(T10=1,IF(H10=3,AH10,0),0)","v":"00:00:00"},{"$f":"IF(B10=\"lør\",\"\",IF(T10=1,IF(H10=6,AH10,0),0))","v":"00:00:00"},{"$f":"IF(B10=\"Lør\",\"\",IF(T10=1,IF(H10=7,AH10,0),0))","v":"00:00:00"},{"$f":"IF(AJ10>0,IF(C10>0,    (AH10*AJ10)/(1-AJ10),0),           IF(B10=\"Lør\",\"\",IF(T10=1,IF(H10=8,AH10,0),0)))","v":"00:00:00"},{"$f":"IF(B10=\"Lør\",\"\",IF(T10=1,IF(H10=9,AH10,0),0))","v":"00:00:00"},{"$f":"IF(B10=\"Lør\",\"\",IF(T10=1,IF(H10=10,AH10,0),0))","v":"00:00:00"},0,0,0,0,0,{"$f":"((IF(A10<$F$5+1,IF(A10>$E$5-1,$G$5,$N$5),$N$5))*(1-AJ10))*(AK10)","v":"07:30:00"},{"$f":"IF(A10<$F$5+1,IF(A10>$E$5-1,$I$5,$M$5),$M$5)","v":"00:00:00"},{"$f":"AJ9","v":0},{"$f":"AK9","v":1}]
[{"$f":"A10+1","v":"2019-08-03"},{"$f":"IF(WEEKDAY(A12,2)=1,WEEKNUM(A11)*-1-MENY!$I$12,IF(WEEKDAY(A11,2)<7,LOOKUP(WEEKDAY(A11,2),MENY!$P$8:$P$14,MENY!$Q$8:$Q$14),\"\"))","v":"Lør"},null,null,null,null,{"$f":"IF(H11=11,F11-C11-(E11-D11),IF(B11=\"Lør\",0,IF(H11=4,0,IF(H11=3,IF(T11>0,W11,\"\"),IF(H11=1,0, IF(C11>0,  AH11,       \"\"))))))","v":"00:00:00"},0,{"$f":"IF(H11=11,\"Ordinær +\",IF(T11=1,IF(H11>0,LOOKUP(H11,MENY!$N$2:O20,MENY!$O$2:$O$18),IF(C11>0,IF(B11=\"Lør\",\"-\",\"Ordinær\"),\"-\")),\"Søndag\"))","v":"-"},null,0,0,null,0,"",null,null,"",null,1,"","","00:00:00","","","","","",0,0,0,0,0,"07:30:00","00:00:00",{"$f":"AJ10","v":0},{"$f":"AK10","v":1}]
["2019-08-04",{"$f":"IF(WEEKDAY(A13,2)=1,WEEKNUM(A12)*-1-MENY!$I$12,IF(WEEKDAY(A12,2)<7,LOOKUP(WEEKDAY(A12,2),MENY!$P$8:$P$14,MENY!$Q$8:$Q$14),\"\"))","v":-32},null,null,null,null,"",0,{"$f":"IF(H12=11,\"Ordinær +\",IF(T12=1,IF(H12>0,LOOKUP(H12,MENY!$N$2:O21,MENY!$O$2:$O$18),IF(C12>0,IF(B12=\"Lør\",\"-\",\"Ordinær\"),\"-\")),\"Søndag\"))","v":"Søndag"},null,0,0,null,0,"",null,null,"",null,0,"00:00:00","","00:00:00","00:00:00","00:00:00","00:00:00","00:00:00","00:00:00",0,0,0,0,0,"07:30:00","00:00:00",0,1]
["2019-08-05",{"$f":"IF(WEEKDAY(A14,2)=1,WEEKNUM(A13)*-1-MENY!$I$12,IF(WEEKDAY(A13,2)<7,LOOKUP(WEEKDAY(A13,2),MENY!$P$8:$P$14,MENY!$Q$8:$Q$14),\"\"))","v":"Man"},null,null,null,null,"",0,{"$f":"IF(H13=11,\"Ordinær +\",IF(T13=1,IF(H13>0,LOOKUP(H13,MENY!$N$2:O22,MENY!$O$2:$O$18),IF(C13>0,IF(B13=\"Lør\",\"-\",\"Ordinær\"),\"-\")),\"Søndag\"))","v":"-"},null,0,0,null,0,"",null,null,"",null,1,"00:00:00",0,"00:00:00","00:00:00","00:00:00","00:00:00","00:00:00","00:00:00",0,0,0,0,0,"07:30:00","00:00:00",0,1]
["2019-08-06",{"$f":"IF(WEEKDAY(A15,2)=1,WEEKNUM(A14)*-1-MENY!$I$12,IF(WEEKDAY(A14,2)<7,LOOKUP(WEEKDAY(A14,2),MENY!$P$8:$P$14,MENY!$Q$8:$Q$14),\"\"))","v":"Tirs"},null,null,null,null,"",0,{"$f":"IF(H14=11,\"Ordinær +\",IF(T14=1,IF(H14>0,LOOKUP(H14,MENY!$N$2:O23,MENY!$O$2:$O$18),IF(C14>0,IF(B14=\"Lør\",\"-\",\"Ordinær\"),\"-\")),\"Søndag\"))","v":"-"},null,0,0,null,0,"",null,null,"",null,1,"00:00:00",0,"00:00:00","00:00:00","00:00:00","00:00:00","00:00:00","00:00:00",0,0,0,0,0,"07:30:00","00:00:00",0,1]
["2019-08-07",{"$f":"IF(WEEKDAY(A16,2)=1,WEEKNUM(A15)*-1-MENY!$I$12,IF(WEEKDAY(A15,2)<7,LOOKUP(WEEKDAY(A15,2),MENY!$P$8:$P$14,MENY!$Q$8:$Q$14),\"\"))","v":"Ons"},null,null,null,null,"",0,{"$f":"IF(H15=11,\"Ordinær +\",IF(T15=1,IF(H15>0,LOOKUP(H15,MENY!$N$2:O24,MENY!$O$2:$O$18),IF(C15>0,IF(B15=\"Lør\",\"-\",\"Ordinær\"),\"-\")),\"Søndag\"))","v":"-"},null,0,0,null,0,"",null,null,"",null,1,"00:00:00",0,"00:00:00","00:00:00","00:00:00","00:00:00","00:00:00","00:00:00",0,0,0,0,0,"07:30:00","00:00:00",0,1]
["2019-08-08",{"$f":"IF(WEEKDAY(A17,2)=1,WEEKNUM(A16)*-1-MENY!$I$12,IF(WEEKDAY(A16,2)<7,LOOKUP(WEEKDAY(A16,2),MENY!$P$8:$P$14,MENY!$Q$8:$Q$14),\"\"))","v":"Tors"},null,null,null,null,"",0,{"$f":"IF(H16=11,\"Ordinær +\",IF(T16=1,IF(H16>0,LOOKUP(H16,MENY!$N$2:O25,MENY!$O$2:$O$18),IF(C16>0,IF(B16=\"Lør\",\"-\",\"Ordinær\"),\"-\")),\"Søndag\"))","v":"-"},null,0,0,null,0,"",null,null,"",null,1,"00:00:00",0,"00:00:00","00:00:00","00:00:00","00:00:00","00:00:00","00:00:00",0,0,0,0,0,"07:30:00","00:00:00",0,1]
["2019-08-09",{"$f":"IF(WEEKDAY(A18,2)=1,WEEKNUM(A17)*-1-MENY!$I$12,IF(WEEKDAY(A17,2)<7,LOOKUP(WEEKDAY(A17,2),MENY!$P$8:$P$14,MENY!$Q$8:$Q$14),\"\"))","v":"Fre"},null,null,null,null,"",0,{"$f":"IF(H17=11,\"Ordinær +\",IF(T17=1,IF(H17>0,LOOKUP(H17,MENY!$N$2:O26,MENY!$O$2:$O$18),IF(C17>0,IF(B17=\"Lør\",\"-\",\"Ordinær\"),\"-\")),\"Søndag\"))","v":"-"},null,0,0,null,0,"",null,null,"",null,1,"00:00:00",0,"00:00:00","00:00:00","00:00:00","00:00:00","00:00:00","00:00:00",0,0,0,0,0,"07:30:00","00:00:00",0,1]
["2019-08-10",{"$f":"IF(WEEKDAY(A19,2)=1,WEEKNUM(A18)*-1-MENY!$I$12,IF(WEEKDAY(A18,2)<7,LOOKUP(WEEKDAY(A18,2),MENY!$P$8:$P$14,MENY!$Q$8:$Q$14),\"\"))","v":"Lør"},null,null,null,null,"00:00:00",0,{"$f":"IF(H18=11,\"Ordinær +\",IF(T18=1,IF(H18>0,LOOKUP(H18,MENY!$N$2:O27,MENY!$O$2:$O$18),IF(C18>0,IF(B18=\"Lør\",\"-\",\"Ordinær\"),\"-\")),\"Søndag\"))","v":"-"},null,0,0,null,0,"",null,null,"",null,1,"","","00:00:00","","","","","",0,0,0,0,0,"07:30:00","00:00:00",0,1]
["2019-08-11",{"$f":"IF(WEEKDAY(A20,2)=1,WEEKNUM(A19)*-1-MENY!$I$12,IF(WEEKDAY(A19,2)<7,LOOKUP(WEEKDAY(A19,2),MENY!$P$8:$P$14,MENY!$Q$8:$Q$14),\"\"))","v":-33},null,null,null,null,"",0,{"$f":"IF(H19=11,\"Ordinær +\",IF(T19=1,IF(H19>0,LOOKUP(H19,MENY!$N$2:O28,MENY!$O$2:$O$18),IF(C19>0,IF(B19=\"Lør\",\"-\",\"Ordinær\"),\"-\")),\"Søndag\"))","v":"Søndag"},null,0,0,null,0,"",null,null,"",null,0,"00:00:00","","00:00:00","00:00:00","00:00:00","00:00:00","00:00:00","00:00:00",0,0,0,0,0,"07:30:00","00:00:00",0,1]
["2019-08-12",{"$f":"IF(WEEKDAY(A21,2)=1,WEEKNUM(A20)*-1-MENY!$I$12,IF(WEEKDAY(A20,2)<7,LOOKUP(WEEKDAY(A20,2),MENY!$P$8:$P$14,MENY!$Q$8:$Q$14),\"\"))","v":"Man"},null,null,null,null,"",0,{"$f":"IF(H20=11,\"Ordinær +\",IF(T20=1,IF(H20>0,LOOKUP(H20,MENY!$N$2:O29,MENY!$O$2:$O$18),IF(C20>0,IF(B20=\"Lør\",\"-\",\"Ordinær\"),\"-\")),\"Søndag\"))","v":"-"},null,0,0,null,0,"",null,null,"",null,1,"00:00:00",0,"00:00:00","00:00:00","00:00:00","00:00:00","00:00:00","00:00:00",0,0,0,0,0,"07:30:00","00:00:00",0,1]
["2019-08-13",{"$f":"IF(WEEKDAY(A22,2)=1,WEEKNUM(A21)*-1-MENY!$I$12,IF(WEEKDAY(A21,2)<7,LOOKUP(WEEKDAY(A21,2),MENY!$P$8:$P$14,MENY!$Q$8:$Q$14),\"\"))","v":"Tirs"},null,null,null,null,"",0,{"$f":"IF(H21=11,\"Ordinær +\",IF(T21=1,IF(H21>0,LOOKUP(H21,MENY!$N$2:O30,MENY!$O$2:$O$18),IF(C21>0,IF(B21=\"Lør\",\"-\",\"Ordinær\"),\"-\")),\"Søndag\"))","v":"-"},null,0,0,null,0,"",null,null,"",null,1,"00:00:00",0,"00:00:00","00:00:00","00:00:00","00:00:00","00:00:00","00:00:00",0,0,0,0,0,"07:30:00","00:00:00",0,1]
["2019-08-14",{"$f":"IF(WEEKDAY(A23,2)=1,WEEKNUM(A22)*-1-MENY!$I$12,IF(WEEKDAY(A22,2)<7,LOOKUP(WEEKDAY(A22,2),MENY!$P$8:$P$14,MENY!$Q$8:$Q$14),\"\"))","v":"Ons"},null,null,null,null,"",0,{"$f":"IF(H22=11,\"Ordinær +\",IF(T22=1,IF(H22>0,LOOKUP(H22,MENY!$N$2:O31,MENY!$O$2:$O$18),IF(C22>0,IF(B22=\"Lør\",\"-\",\"Ordinær\"),\"-\")),\"Søndag\"))","v":"-"},null,0,0,null,0,"",null,null,"",null,1,"00:00:00",0,"00:00:00","00:00:00","00:00:00","00:00:00","00:00:00","00:00:00",0,0,0,0,0,"07:30:00","00:00:00",0,1]
["2019-08-15",{"$f":"IF(WEEKDAY(A24,2)=1,WEEKNUM(A23)*-1-MENY!$I$12,IF(WEEKDAY(A23,2)<7,LOOKUP(WEEKDAY(A23,2),MENY!$P$8:$P$14,MENY!$Q$8:$Q$14),\"\"))","v":"Tors"},null,null,null,null,"",0,{"$f":"IF(H23=11,\"Ordinær +\",IF(T23=1,IF(H23>0,LOOKUP(H23,MENY!$N$2:O32,MENY!$O$2:$O$18),IF(C23>0,IF(B23=\"Lør\",\"-\",\"Ordinær\"),\"-\")),\"Søndag\"))","v":"-"},null,0,0,null,0,"",null,null,"",null,1,"00:00:00",0,"00:00:00","00:00:00","00:00:00","00:00:00","00:00:00","00:00:00",0,0,0,0,0,"07:30:00","00:00:00",0,1]
["2019-08-16",{"$f":"IF(WEEKDAY(A25,2)=1,WEEKNUM(A24)*-1-MENY!$I$12,IF(WEEKDAY(A24,2)<7,LOOKUP(WEEKDAY(A24,2),MENY!$P$8:$P$14,MENY!$Q$8:$Q$14),\"\"))","v":"Fre"},null,null,null,null,"",0,{"$f":"IF(H24=11,\"Ordinær +\",IF(T24=1,IF(H24>0,LOOKUP(H24,MENY!$N$2:O33,MENY!$O$2:$O$18),IF(C24>0,IF(B24=\"Lør\",\"-\",\"Ordinær\"),\"-\")),\"Søndag\"))","v":"-"},null,0,0,null,0,"",null,null,"",null,1,"00:00:00",0,"00:00:00","00:00:00","00:00:00","00:00:00","00:00:00","00:00:00",0,0,0,0,0,"07:30:00","00:00:00",0,1]
["2019-08-17",{"$f":"IF(WEEKDAY(A26,2)=1,WEEKNUM(A25)*-1-MENY!$I$12,IF(WEEKDAY(A25,2)<7,LOOKUP(WEEKDAY(A25,2),MENY!$P$8:$P$14,MENY!$Q$8:$Q$14),\"\"))","v":"Lør"},null,null,null,null,"00:00:00",0,{"$f":"IF(H25=11,\"Ordinær +\",IF(T25=1,IF(H25>0,LOOKUP(H25,MENY!$N$2:O34,MENY!$O$2:$O$18),IF(C25>0,IF(B25=\"Lør\",\"-\",\"Ordinær\"),\"-\")),\"Søndag\"))","v":"-"},null,0,0,null,0,"",null,null,"",null,1,"","","00:00:00","","","","","",0,0,0,0,0,"07:30:00","00:00:00",0,1]
["2019-08-18",{"$f":"IF(WEEKDAY(A27,2)=1,WEEKNUM(A26)*-1-MENY!$I$12,IF(WEEKDAY(A26,2)<7,LOOKUP(WEEKDAY(A26,2),MENY!$P$8:$P$14,MENY!$Q$8:$Q$14),\"\"))","v":-34},null,null,null,null,"",0,{"$f":"IF(H26=11,\"Ordinær +\",IF(T26=1,IF(H26>0,LOOKUP(H26,MENY!$N$2:O35,MENY!$O$2:$O$18),IF(C26>0,IF(B26=\"Lør\",\"-\",\"Ordinær\"),\"-\")),\"Søndag\"))","v":"Søndag"},null,0,0,null,0,"",null,null,"",null,0,"00:00:00","","00:00:00","00:00:00","00:00:00","00:00:00","00:00:00","00:00:00",0,0,0,0,0,"07:30:00","00:00:00",0,1]
["2019-08-19",{"$f":"IF(WEEKDAY(A28,2)=1,WEEKNUM(A27)*-1-MENY!$I$12,IF(WEEKDAY(A27,2)<7,LOOKUP(WEEKDAY(A27,2),MENY!$P$8:$P$14,MENY!$Q$8:$Q$14),\"\"))","v":"Man"},null,null,null,null,"",0,{"$f":"IF(H27=11,\"Ordinær +\",IF(T27=1,IF(H27>0,LOOKUP(H27,MENY!$N$2:O36,MENY!$O$2:$O$18),IF(C27>0,IF(B27=\"Lør\",\"-\",\"Ordinær\"),\"-\")),\"Søndag\"))","v":"-"},null,0,0,null,0,"",null,null,"",null,1,"00:00:00",0,"00:00:00","00:00:00","00:00:00","00:00:00","00:00:00","00:00:00",0,0,0,0,0,"07:30:00","00:00:00",0,1]
["2019-08-20",{"$f":"IF(WEEKDAY(A29,2)=1,WEEKNUM(A28)*-1-MENY!$I$12,IF(WEEKDAY(A28,2)<7,LOOKUP(WEEKDAY(A28,2),MENY!$P$8:$P$14,MENY!$Q$8:$Q$14),\"\"))","v":"Tirs"},null,null,null,null,"",0,{"$f":"IF(H28=11,\"Ordinær +\",IF(T28=1,IF(H28>0,LOOKUP(H28,MENY!$N$2:O37,MENY!$O$2:$O$18),IF(C28>0,IF(B28=\"Lør\",\"-\",\"Ordinær\"),\"-\")),\"Søndag\"))","v":"-"},null,0,0,null,0,"",null,null,"",null,1,"00:00:00",0,"00:00:00","00:00:00","00:00:00","00:00:00","00:00:00","00:00:00",0,0,0,0,0,"07:30:00","00:00:00",0,1]
["2019-08-21",{"$f":"IF(WEEKDAY(A30,2)=1,WEEKNUM(A29)*-1-MENY!$I$12,IF(WEEKDAY(A29,2)<7,LOOKUP(WEEKDAY(A29,2),MENY!$P$8:$P$14,MENY!$Q$8:$Q$14),\"\"))","v":"Ons"},null,null,null,null,"",0,{"$f":"IF(H29=11,\"Ordinær +\",IF(T29=1,IF(H29>0,LOOKUP(H29,MENY!$N$2:O38,MENY!$O$2:$O$18),IF(C29>0,IF(B29=\"Lør\",\"-\",\"Ordinær\"),\"-\")),\"Søndag\"))","v":"-"},null,0,0,null,0,"",null,null,"",null,1,"00:00:00",0,"00:00:00","00:00:00","00:00:00","00:00:00","00:00:00","00:00:00",0,0,0,0,0,"07:30:00","00:00:00",0,1]
["2019-08-22",{"$f":"IF(WEEKDAY(A31,2)=1,WEEKNUM(A30)*-1-MENY!$I$12,IF(WEEKDAY(A30,2)<7,LOOKUP(WEEKDAY(A30,2),MENY!$P$8:$P$14,MENY!$Q$8:$Q$14),\"\"))","v":"Tors"},null,null,null,null,"",0,{"$f":"IF(H30=11,\"Ordinær +\",IF(T30=1,IF(H30>0,LOOKUP(H30,MENY!$N$2:O39,MENY!$O$2:$O$18),IF(C30>0,IF(B30=\"Lør\",\"-\",\"Ordinær\"),\"-\")),\"Søndag\"))","v":"-"},null,0,0,null,0,"",null,null,"",null,1,"00:00:00",0,"00:00:00","00:00:00","00:00:00","00:00:00","00:00:00","00:00:00",0,0,0,0,0,"07:30:00","00:00:00",0,1]
["2019-08-23",{"$f":"IF(WEEKDAY(A32,2)=1,WEEKNUM(A31)*-1-MENY!$I$12,IF(WEEKDAY(A31,2)<7,LOOKUP(WEEKDAY(A31,2),MENY!$P$8:$P$14,MENY!$Q$8:$Q$14),\"\"))","v":"Fre"},null,null,null,null,"",0,{"$f":"IF(H31=11,\"Ordinær +\",IF(T31=1,IF(H31>0,LOOKUP(H31,MENY!$N$2:O40,MENY!$O$2:$O$18),IF(C31>0,IF(B31=\"Lør\",\"-\",\"Ordinær\"),\"-\")),\"Søndag\"))","v":"-"},null,0,0,null,0,"",null,null,"",null,1,"00:00:00",0,"00:00:00","00:00:00","00:00:00","00:00:00","00:00:00","00:00:00",0,0,0,0,0,"07:30:00","00:00:00",0,1]
["2019-08-24",{"$f":"IF(WEEKDAY(A33,2)=1,WEEKNUM(A32)*-1-MENY!$I$12,IF(WEEKDAY(A32,2)<7,LOOKUP(WEEKDAY(A32,2),MENY!$P$8:$P$14,MENY!$Q$8:$Q$14),\"\"))","v":"Lør"},null,null,null,null,"00:00:00",0,{"$f":"IF(H32=11,\"Ordinær +\",IF(T32=1,IF(H32>0,LOOKUP(H32,MENY!$N$2:O41,MENY!$O$2:$O$18),IF(C32>0,IF(B32=\"Lør\",\"-\",\"Ordinær\"),\"-\")),\"Søndag\"))","v":"-"},null,0,0,null,0,"",null,null,"",null,1,"","","00:00:00","","","","","",0,0,0,0,0,"07:30:00","00:00:00",0,1]
["2019-08-25",{"$f":"IF(WEEKDAY(A34,2)=1,WEEKNUM(A33)*-1-MENY!$I$12,IF(WEEKDAY(A33,2)<7,LOOKUP(WEEKDAY(A33,2),MENY!$P$8:$P$14,MENY!$Q$8:$Q$14),\"\"))","v":-35},null,null,null,null,"",0,{"$f":"IF(H33=11,\"Ordinær +\",IF(T33=1,IF(H33>0,LOOKUP(H33,MENY!$N$2:O42,MENY!$O$2:$O$18),IF(C33>0,IF(B33=\"Lør\",\"-\",\"Ordinær\"),\"-\")),\"Søndag\"))","v":"Søndag"},null,0,0,null,0,"",null,null,"",null,0,"00:00:00","","00:00:00","00:00:00","00:00:00","00:00:00","00:00:00","00:00:00",0,0,0,0,0,"07:30:00","00:00:00",0,1]
["2019-08-26",{"$f":"IF(WEEKDAY(A35,2)=1,WEEKNUM(A34)*-1-MENY!$I$12,IF(WEEKDAY(A34,2)<7,LOOKUP(WEEKDAY(A34,2),MENY!$P$8:$P$14,MENY!$Q$8:$Q$14),\"\"))","v":"Man"},null,null,null,null,"",0,{"$f":"IF(H34=11,\"Ordinær +\",IF(T34=1,IF(H34>0,LOOKUP(H34,MENY!$N$2:O43,MENY!$O$2:$O$18),IF(C34>0,IF(B34=\"Lør\",\"-\",\"Ordinær\"),\"-\")),\"Søndag\"))","v":"-"},null,0,0,null,0,"",null,null,"",null,1,"00:00:00",0,"00:00:00","00:00:00","00:00:00","00:00:00","00:00:00","00:00:00",0,0,0,0,0,"07:30:00","00:00:00",0,1]
["2019-08-27",{"$f":"IF(WEEKDAY(A36,2)=1,WEEKNUM(A35)*-1-MENY!$I$12,IF(WEEKDAY(A35,2)<7,LOOKUP(WEEKDAY(A35,2),MENY!$P$8:$P$14,MENY!$Q$8:$Q$14),\"\"))","v":"Tirs"},null,null,null,null,"",0,{"$f":"IF(H35=11,\"Ordinær +\",IF(T35=1,IF(H35>0,LOOKUP(H35,MENY!$N$2:O44,MENY!$O$2:$O$18),IF(C35>0,IF(B35=\"Lør\",\"-\",\"Ordinær\"),\"-\")),\"Søndag\"))","v":"-"},null,0,0,null,0,"",null,null,"",null,{"$f":"IF(A35>0,IF(WEEKDAY(A35-1)<7,1,0),\"\")","v":1},"00:00:00",0,"00:00:00","00:00:00","00:00:00","00:00:00","00:00:00","00:00:00",0,0,0,0,0,"07:30:00","00:00:00",0,1]
["2019-08-28",{"$f":"IF(WEEKDAY(A37,2)=1,WEEKNUM(A36)*-1-MENY!$I$12,IF(WEEKDAY(A36,2)<7,LOOKUP(WEEKDAY(A36,2),MENY!$P$8:$P$14,MENY!$Q$8:$Q$14),\"\"))","v":"Ons"},null,null,null,null,"",0,{"$f":"IF(H36=11,\"Ordinær +\",IF(T36=1,IF(H36>0,LOOKUP(H36,MENY!$N$2:O45,MENY!$O$2:$O$18),IF(C36>0,IF(B36=\"Lør\",\"-\",\"Ordinær\"),\"-\")),\"Søndag\"))","v":"-"},null,0,0,null,0,"",null,null,"",null,{"$f":"IF(A36>0,IF(WEEKDAY(A36-1)<7,1,0),\"\")","v":1},"00:00:00",0,"00:00:00","00:00:00","00:00:00","00:00:00","00:00:00","00:00:00",0,0,0,0,0,"07:30:00","00:00:00",0,1]
["2019-08-29",{"$f":"IF(WEEKDAY(A38,2)=1,WEEKNUM(A37)*-1-MENY!$I$12,IF(WEEKDAY(A37,2)<7,LOOKUP(WEEKDAY(A37,2),MENY!$P$8:$P$14,MENY!$Q$8:$Q$14),\"\"))","v":"Tors"},null,null,null,null,"",0,{"$f":"IF(H37=11,\"Ordinær +\",IF(T37=1,IF(H37>0,LOOKUP(H37,MENY!$N$2:O46,MENY!$O$2:$O$18),IF(C37>0,IF(B37=\"Lør\",\"-\",\"Ordinær\"),\"-\")),\"Søndag\"))","v":"-"},null,0,0,null,0,"",null,null,"",null,{"$f":"IF(A37>0,IF(WEEKDAY(A37-1)<7,1,0),\"\")","v":1},"00:00:00",0,"00:00:00","00:00:00","00:00:00","00:00:00","00:00:00","00:00:00",0,0,0,0,0,"07:30:00","00:00:00",0,1]
["2019-08-30",{"$f":"IF(WEEKDAY(A39,2)=1,WEEKNUM(A38)*-1-MENY!$I$12,IF(WEEKDAY(A38,2)<7,LOOKUP(WEEKDAY(A38,2),MENY!$P$8:$P$14,MENY!$Q$8:$Q$14),\"\"))","v":"Fre"},null,null,null,null,"",0,{"$f":"IF(H38=11,\"Ordinær +\",IF(T38=1,IF(H38>0,LOOKUP(H38,MENY!$N$2:O47,MENY!$O$2:$O$18),IF(C38>0,IF(B38=\"Lør\",\"-\",\"Ordinær\"),\"-\")),\"Søndag\"))","v":"-"},null,0,0,null,0,"",null,null,"",null,{"$f":"IF(A38>0,IF(WEEKDAY(A38-1)<7,1,0),\"\")","v":1},"00:00:00",0,"00:00:00","00:00:00","00:00:00","00:00:00","00:00:00","00:00:00",0,0,0,0,0,"07:30:00","00:00:00",0,1]
["2019-08-31",{"$f":"IF(WEEKDAY(A40,2)=1,WEEKNUM(A39)*-1-MENY!$I$12,IF(WEEKDAY(A39,2)<7,LOOKUP(WEEKDAY(A39,2),MENY!$P$8:$P$14,MENY!$Q$8:$Q$14),\"\"))","v":"Lør"},null,null,null,null,"00:00:00",0,{"$f":"IF(H39=11,\"Ordinær +\",IF(T39=1,IF(H39>0,LOOKUP(H39,MENY!$N$2:O48,MENY!$O$2:$O$18),IF(C39>0,IF(B39=\"Lør\",\"-\",\"Ordinær\"),\"-\")),\"Søndag\"))","v":"-"},null,0,0,null,0,"",null,null,"",null,{"$f":"IF(A39>0,IF(WEEKDAY(A39-1)<7,1,0),\"\")","v":1},"","","00:00:00","","","",{"$f":"IF(B39=\"Lør\",\"\",IF(T39=1,IF(H39=9,AH39,0),0))","v":""},"",0,0,0,0,0,"07:30:00","00:00:00",0,1]
[null,null,null,"Sum for denne måned",null,null,{"$f":"SUM(G9:G39)*24","v":0},null,null,null,{"$f":"SUM(K9:K39)+N49","v":0},{"$f":"SUM(L9:L39)","v":0},{"$f":"SUM(M9:M39)","v":0},{"$f":"SUM(N9:N39)-U40-AG41-SUM(K40:M40)+N50","v":0},{"$f":"SUM(O9:O39)","v":0},"Fravær denne måned",null,null,null,null,{"$f":"SUM(U9:U39)*24","v":0},{"$f":"SUM(V9:V39)","v":0},{"$f":"SUM(W9:W39)*24","v":0},0,0,0,0,0,{"$f":"SUM(AC9:AC39)","v":0},{"$f":"SUM(AD9:AD39)","v":0},{"$f":"SUM(AE9:AE39)","v":0},{"$f":"SUM(AF9:AF39)","v":0},{"$f":"SUM(AG9:AG39)","v":0}]
[null,null,null,"Overført fra forrige måned",null,null,null,null,null,null,null,null,null,{"$f":"JUL!N47","v":0},{"$f":"JUL!O42","v":0},"Type","Timer",null,null,null,null,null,null,null,null,null,null,null,null,null,null,"Sum deltidsfravær:",{"$f":"SUM(AC40:AG40)","v":0}]
[null,null,null,"Sum hittil i år",null,null,null,null,null,null,null,null,null,{"$f":"SUM(N40:N41)","v":0},{"$f":"SUM(O40:O41)","v":0},"06 Perm m/lønn",{"$f":"X40+AC40*-1","v":0}]
["Ferieregnskap",null,null,"Dager","Timeregnskap",null,null,null,null,null,null,null,null,"Timer",null,"07 Perm u/lønn",{"$f":"Y40+AD40*-1","v":0}]
["Disponible feriedager",null,null,{"$f":"JUL!D47","v":25},"Opptjent denne måneden",null,null,null,null,null,null,null,null,{"$f":"SUM(N9:N39)-AG41-(SUM(K40:M40))+N50","v":0},null,"08 Sykemelding",{"$f":"(Z40+AE40*-1)","v":0}]
["Brukt denne måned",null,null,{"$f":"V40*-1","v":0},"Avspasert denne måneden",null,null,null,null,null,null,null,null,{"$f":"U40","v":0},null,"09 Egenmelding",{"$f":"(AA40+AF40*-1)","v":0}]
["Endring i feriedager",null,null,null,"Utbetalt overtid denne måned",null,null,null,null,null,null,null,null,{"$f":"SUM(K40:M40)","v":0},null,"10 Sykt barn",{"$f":"(AB40+AG40*-1)","v":0}]
["Til gode",null,null,{"$f":"SUM(D44:D46)","v":25},"Til gode for avspasering",null,null,null,null,null,null,null,null,{"$f":"N42","v":0},null,"Sum - August",{"$f":"SUM(Q42:Q46)","v":0}]
[null,null,null,null,"Effektiv arbeidstid denne måned",null,null,null,null,null,null,null,null,{"$f":"G40+N44+AG41+N46-N50","v":0},null,"Hittil i år",{"$f":"Q47+JUL!Q48","v":0}]
[null,null,null,null,"Flexitid omgjort til overtid og utbetalt, denne måned"]
[null,null,null,null,"Annen korrigering av flexitid, OBS! skriv egen merknad"]
["Merknader"]
[]
[]
[]
[]
[]
["Overtid for utbetaling:",null,null,null,null,null,"Dato",null,null,null,null,null,null,null,"Dato"]
[null,null,null,"Timer med 50% tillegg :",{"$f":"K40","v":0}]
[null,null,null,"Timer med 100% tillegg:",{"$f":"L40","v":0}]
[null,null,null,"Timer med 133% tillegg:",{"$f":"M39","v":0},null,null,null,"Attestert",null,null,null,null,null,"Anvist"]
[]
[]
[null,null,null,null,null,null,null,null,null,null,null,null,null,null,null,{"$f":"MENY!D6","v":"Leder"}]
["© Ole Jørgen Klaussen - 2003",null,null,null,{"$f":"TODAY()","v":"2018-11-30"},{"$f":"YEAR(TODAY())","v":2018},null,null,null,null,null,null,null,null,null,null,"ole.klaussen@online.no"]

{"sheet":"SEP","index":9,"n_rows":64,"n_cols":37,"rows_kept":64,"cut":false,"hidden":false,"merged":[[16,15,16,16],[24,15,24,16],[17,15,17,16],[18,15,18,16],[2,1,2,6],[8,15,8,16],[9,15,9,16],[10,15,10,16],[6,3,6,4],[7,7,7,8],[5,7,6,16],[2,15,2,16],[14,15,14,16],[11,15,11,16],[12,15,12,16],[13,15,13,16],[15,15,15,16],[7,15,7,16],[38,15,38,16],[31,15,31,16],[32,15,32,16],[33,15,33,16],[34,15,34,16],[36,15,36,16],[37,15,37,16],[35,15,35,16],[25,15,25,16],[26,15,26,16],[19,15,19,16],[20,15,20,16],[21,15,21,16],[22,15,22,16],[23,15,23,16],[54,0,54,16],[3,15,4,16],[1,28,2,33],[59,14,59,16],[62,6,62,10],[55,0,55,16],[56,6,56,10],[56,14,56,16],[51,0,51,16],[52,0,52,16],[53,0,53,16],[27,15,27,16],[28,15,28,16],[29,15,29,16],[30,15,30,16],[5,19,5,22]]}
["Meny","JAN","FEB","MAR","APR","MAI","JUN",null,null,null,null,null,null,null,null,null,"Hjelp","Viktig når det gjelder overtid"]
["Året","JUL","AUG","SEP","OKT","NOV","DES",null,null,null,null,null,null,null,null,"Dato",null,"For at føringer av aktiv arbeidstid skal bli riktig"]
[null,{"$f":"MENY!D4","v":"Min bedrift"},null,null,null,null,null,null,"September -",null,null,null,null,{"$f":"MENY!P1","v":2019},null,{"$f":"TODAY()","v":"2018-11-30"},null,"er det nødvendig at all arbeidstid registreres."]
[null,"Timeliste","Navn:",{"$f":"MENY!D5","v":"Min timeliste"},null,null,"Sommer",null,null,null,"Stillingsbrøk:",{"$f":"MENY!I5","v":1},null,"Vinter",null,null,null,"Dette gjelder også overtid. Så registrer  når du ",null,null,null,null,null,null,null,null,null,null,null,null,null,null,null,null,null,"MERK!"]
[null,null,"Sommerlukking fra/til:",null,{"$f":"MENY!Q18","v":"2019-05-15"},{"$f":"MENY!Q19","v":"2019-09-14"},{"$f":"(MENY!F13-MENY!E13-MENY!I13)*MENY!I5","v":"07:30:00"},null,{"$f":"MENY!I13","v":"00:00:00"},"  <-arbeidstid->",null,null,{"$f":"MENY!I14","v":"00:00:00"},{"$f":"(MENY!F14-MENY!E14-MENY!I14)*MENY!I5","v":"07:30:00"},null,null,null,"kommer på jobb (inn) og når du er ferdig (ut)",null,null,null,null,null,null,null,null,null,null,null,null,null,null,null,null,null,"Les her"]
["År ",null,null,null,null,null,null,"Fyll ut i arbeids og fraværskode : 0=ordinær  1=Avspasere  2=Ferie  3=Tjeneste  4=Plussdag  5=Helligdag  6=Perm M/lønn  7=Perm U/lønn  8=Sykemelding  9=Egenmelding 10=Sykt barn 11=Ordinær+ , 12 = plusstid som overtid",null,null,null,null,null,null,null,null,null,"Dersom noe av tiden skal utbetales i overtid, så",null,"Arbeidsdata",null,null,null,null,null,null,null,null,6,7,8,9,10,null,null,"Syke-","Stillings"]
[{"$f":"N3","v":2019},{"$f":"WEEKNUM(A9)+MENY!I12","v":36},"I dag","Fravær pr dag",null,"I dag",null,null,null,null,null,null,null,null,null,null,null,"legg inn antall timer nederst på arket.",null,null,null,null,null,6,7,8,9,10,12,13,14,15,16,null,null,"melding","brøk"]
["DATO","UKENR                               og DAG","Inn","Ut","Inn","Ut","Ordinær","Arbeids og fraværskode",null,"Fravær",0.5,1,1.33,"Balanse","Timer i dag","Merknad ",null,"Huskeliste",null,"Arbeids dag","Avsp","Ferie","Tjeneste","Perm m-lønn","Perm u-lønn","Sykemelding","Egenmelding","Sykt barn","Perm m-lønn","Perm u-lønn","Sykemelding","Egenmelding","Sykt barn","Ordinær arbeidstid","Trekk for matpause","i prosent andel"]
[{"$f":"DATE(MENY!P1,9,1)","v":"2019-09-01"},{"$f":"IF(WEEKDAY(A10,2)=1,WEEKNUM(A9)*-1-MENY!$I$12,IF(WEEKDAY(A9,2)<7,LOOKUP(WEEKDAY(A9,2),MENY!$P$8:$P$14,MENY!$Q$8:$Q$14),\"\"))","v":-36},null,null,null,null,{"$f":"IF(H9=11,F9-C9-(E9-D9),IF(B9=\"Lør\",0,IF(H9=4,0,IF(H9=3,IF(T9>0,W9,\"\"),IF(H9=1,0, IF(C9>0,  AH9,       \"\"))))))","v":""},{"$f":"IF(B9=\"Lør\",IF(C9>0,4,0),0)","v":0},{"$f":"IF(H9=11,\"Ordinær +\",IF(T9=1,IF(H9>0,LOOKUP(H9,MENY!$N$2:O18,MENY!$O$2:$O$18),IF(C9>0,IF(B9=\"Lør\",\"-\",\"Ordinær\"),\"-\")),\"Søndag\"))","v":"Søndag"},null,{"$f":"IF(H9=12,IF(N9>=4,4,N9),0)","v":0},{"$f":"IF(H9=12,IF(N9>K9,N9-4,0),0)","v":0},null,{"$f":"IF(H9=11,0,IF(T9=1,IF(H9=4,((F9-C9)-(E9-D9))*24,IF(C9>0,(F9-C9-(E9-D9)-G9-AI9)*24,0)),0))","v":0},{"$f":"IF(F9>0,G9*24+N9,\"\")","v":""},null,null,{"$f":"IF(O9=\"\",\"\",\"Husk, fordel timer til prosjekter\")","v":""},null,{"$f":"IF(WEEKDAY(A9-1)<7,1,0)","v":0},{"$f":"IF(B9=\"Lør\",\"\",IF(T9=1,IF(H9=1,AH9,0),0))","v":"00:00:00"},{"$f":"IF(T9=1,IF(B9=\"lør\",\"\",IF(H9=2,1,0)),\"\")","v":""},{"$f":"IF(T9=1,IF(H9=3,AH9,0),0)","v":"00:00:00"},{"$f":"IF(B9=\"lør\",\"\",IF(T9=1,IF(H9=6,AH9,0),0))","v":"00:00:00"},{"$f":"IF(B9=\"Lør\",\"\",IF(T9=1,IF(H9=7,AH9,0),0))","v":"00:00:00"},{"$f":"IF(AJ9>0,IF(C9>0,    (AH9*AJ9)/(1-AJ9),0),           IF(B9=\"Lør\",\"\",IF(T9=1,IF(H9=8,AH9,0),0)))","v":"00:00:00"},{"$f":"IF(B9=\"Lør\",\"\",IF(T9=1,IF(H9=9,AH9,0),0))","v":"00:00:00"},{"$f":"IF(B9=\"Lør\",\"\",IF(T9=1,IF(H9=10,AH9,0),0))","v":"00:00:00"},{"$f":"IF(J9=6,N9,0)","v":0},{"$f":"IF(J9=7,N9,0)","v":0},{"$f":"IF(J9=8,N9,0)","v":0},{"$f":"IF(J9=9,N9,0)","v":0},{"$f":"IF(J9=10,N9,0)","v":0},{"$f":"((IF(A9<$F$5+1,IF(A9>$E$5-1,$G$5,$N$5),$N$5))*(1-AJ9))*(AK9)","v":"07:30:00"},{"$f":"IF(A9<$F$5+1,IF(A9>$E$5-1,$I$5,$M$5),$M$5)","v":"00:00:00"},{"$f":"AUG!AJ39","v":0},{"$f":"AUG!AK39","v":1}]
[{"$f":"A9+1","v":"2019-09-02"},{"$f":"IF(WEEKDAY(A11,2)=1,WEEKNUM(A10)*-1-MENY!$I$12,IF(WEEKDAY(A10,2)<7,LOOKUP(WEEKDAY(A10,2),MENY!$P$8:$P$14,MENY!$Q$8:$Q$14),\"\"))","v":"Man"},null,null,null,null,{"$f":"IF(H10=11,F10-C10-(E10-D10),IF(B10=\"Lør\",0,IF(H10=4,0,IF(H10=3,IF(T10>0,W10,\"\"),IF(H10=1,0, IF(C10>0,  AH10,       \"\"))))))","v":""},0,{"$f":"IF(H10=11,\"Ordinær +\",IF(T10=1,IF(H10>0,LOOKUP(H10,MENY!$N$2:O19,MENY!$O$2:$O$18),IF(C10>0,IF(B10=\"Lør\",\"-\",\"Ordinær\"),\"-\")),\"Søndag\"))","v":"-"},null,{"$f":"IF(H10=12,IF(N10>=4,4,N10),0)","v":0},{"$f":"IF(H10=12,IF(N10>K10,N10-4,0),0)","v":0},null,{"$f":"IF(H10=11,0,IF(T10=1,IF(H10=4,((F10-C10)-(E10-D10))*24,IF(C10>0,(F10-C10-(E10-D10)-G10-AI10)*24,0)),0))","v":0},{"$f":"IF(F10>0,G10*24+N10,\"\")","v":""},null,null,{"$f":"IF(O10=\"\",\"\",\"Husk, fordel timer til prosjekter\")","v":""},null,{"$f":"IF(WEEKDAY(A10-1)<7,1,0)","v":1},{"$f":"IF(B10=\"Lør\",\"\",IF(T10=1,IF(H10=1,AH10,0),0))","v":"00:00:00"},0,{"$f":"IF(T10=1,IF(H10=3,AH10,0),0)","v":"00:00:00"},{"$f":"IF(B10=\"lør\",\"\",IF(T10=1,IF(H10=6,AH10,0),0))","v":"00:00:00"},{"$f":"IF(B10=\"Lør\",\"\",IF(T10=1,IF(H10=7,AH10,0),0))","v":"00:00:00"},{"$f":"IF(AJ10>0,IF(C10>0,    (AH10*AJ10)/(1-AJ10),0),           IF(B10=\"Lør\",\"\",IF(T10=1,IF(H10=8,AH10,0),0)))","v":"00:00:00"},{"$f":"IF(B10=\"Lør\",\"\",IF(T10=1,IF(H10=9,AH10,0),0))","v":"00:00:00"},{"$f":"IF(B10=\"Lør\",\"\",IF(T10=1,IF(H10=10,AH10,0),0))","v":"00:00:00"},0,0,0,0,0,{"$f":"((IF(A10<$F$5+1,IF(A10>$E$5-1,$G$5,$N$5),$N$5))*(1-AJ10))*(AK10)","v":"07:30:00"},{"$f":"IF(A10<$F$5+1,IF(A10>$E$5-1,$I$5,$M$5),$M$5)","v":"00:00:00"},{"$f":"AJ9","v":0},{"$f":"AK9","v":1}]
[{"$f":"A10+1","v":"2019-09-03"},{"$f":"IF(WEEKDAY(A12,2)=1,WEEKNUM(A11)*-1-MENY!$I$12,IF(WEEKDAY(A11,2)<7,LOOKUP(WEEKDAY(A11,2),MENY!$P$8:$P$14,MENY!$Q$8:$Q$14),\"\"))","v":"Tirs"},null,null,null,null,{"$f":"IF(H11=11,F11-C11-(E11-D11),IF(B11=\"Lør\",0,IF(H11=4,0,IF(H11=3,IF(T11>0,W11,\"\"),IF(H11=1,0, IF(C11>0,  AH11,       \"\"))))))","v":""},0,{"$f":"IF(H11=11,\"Ordinær +\",IF(T11=1,IF(H11>0,LOOKUP(H11,MENY!$N$2:O20,MENY!$O$2:$O$18),IF(C11>0,IF(B11=\"Lør\",\"-\",\"Ordinær\"),\"-\")),\"Søndag\"))","v":"-"},null,0,0,null,0,"",null,null,"",null,1,"00:00:00",0,"00:00:00","00:00:00","00:00:00","00:00:00","00:00:00","00:00:00",0,0,0,0,0,"07:30:00","00:00:00",{"$f":"AJ10","v":0},{"$f":"AK10","v":1}]
["2019-09-04",{"$f":"IF(WEEKDAY(A13,2)=1,WEEKNUM(A12)*-1-MENY!$I$12,IF(WEEKDAY(A12,2)<7,LOOKUP(WEEKDAY(A12,2),MENY!$P$8:$P$14,MENY!$Q$8:$Q$14),\"\"))","v":"Ons"},null,null,null,null,"",0,{"$f":"IF(H12=11,\"Ordinær +\",IF(T12=1,IF(H12>0,LOOKUP(H12,MENY!$N$2:O21,MENY!$O$2:$O$18),IF(C12>0,IF(B12=\"Lør\",\"-\",\"Ordinær\"),\"-\")),\"Søndag\"))","v":"-"},null,0,0,null,0,"",null,null,"",null,1,"00:00:00",0,"00:00:00","00:00:00","00:00:00","00:00:00","00:00:00","00:00:00",0,0,0,0,0,"07:30:00","00:00:00",0,1]
["2019-09-05",{"$f":"IF(WEEKDAY(A14,2)=1,WEEKNUM(A13)*-1-MENY!$I$12,IF(WEEKDAY(A13,2)<7,LOOKUP(WEEKDAY(A13,2),MENY!$P$8:$P$14,MENY!$Q$8:$Q$14),\"\"))","v":"Tors"},null,null,null,null,"",0,{"$f":"IF(H13=11,\"Ordinær +\",IF(T13=1,IF(H13>0,LOOKUP(H13,MENY!$N$2:O22,MENY!$O$2:$O$18),IF(C13>0,IF(B13=\"Lør\",\"-\",\"Ordinær\"),\"-\")),\"Søndag\"))","v":"-"},null,0,0,null,0,"",null,null,"",null,1,"00:00:00",0,"00:00:00","00:00:00","00:00:00","00:00:00","00:00:00","00:00:00",0,0,0,0,0,"07:30:00","00:00:00",0,1]
["2019-09-06",{"$f":"IF(WEEKDAY(A15,2)=1,WEEKNUM(A14)*-1-MENY!$I$12,IF(WEEKDAY(A14,2)<7,LOOKUP(WEEKDAY(A14,2),MENY!$P$8:$P$14,MENY!$Q$8:$Q$14),\"\"))","v":"Fre"},null,null,null,null,"",0,{"$f":"IF(H14=11,\"Ordinær +\",IF(T14=1,IF(H14>0,LOOKUP(H14,MENY!$N$2:O23,MENY!$O$2:$O$18),IF(C14>0,IF(B14=\"Lør\",\"-\",\"Ordinær\"),\"-\")),\"Søndag\"))","v":"-"},null,0,0,null,0,"",null,null,"",null,1,"00:00:00",0,"00:00:00","00:00:00","00:00:00","00:00:00","00:00:00","00:00:00",0,0,0,0,0,"07:30:00","00:00:00",0,1]
["2019-09-07",{"$f":"IF(WEEKDAY(A16,2)=1,WEEKNUM(A15)*-1-MENY!$I$12,IF(WEEKDAY(A15,2)<7,LOOKUP(WEEKDAY(A15,2),MENY!$P$8:$P$14,MENY!$Q$8:$Q$14),\"\"))","v":"Lør"},null,null,null,null,"00:00:00",0,{"$f":"IF(H15=11,\"Ordinær +\",IF(T15=1,IF(H15>0,LOOKUP(H15,MENY!$N$2:O24,MENY!$O$2:$O$18),IF(C15>0,IF(B15=\"Lør\",\"-\",\"Ordinær\"),\"-\")),\"Søndag\"))","v":"-"},null,0,0,null,0,"",null,null,"",null,1,"","","00:00:00","","","","","",0,0,0,0,0,"07:30:00","00:00:00",0,1]
["2019-09-08",{"$f":"IF(WEEKDAY(A17,2)=1,WEEKNUM(A16)*-1-MENY!$I$12,IF(WEEKDAY(A16,2)<7,LOOKUP(WEEKDAY(A16,2),MENY!$P$8:$P$14,MENY!$Q$8:$Q$14),\"\"))","v":-37},null,null,null,null,"",0,{"$f":"IF(H16=11,\"Ordinær +\",IF(T16=1,IF(H16>0,LOOKUP(H16,MENY!$N$2:O25,MENY!$O$2:$O$18),IF(C16>0,IF(B16=\"Lør\",\"-\",\"Ordinær\"),\"-\")),\"Søndag\"))","v":"Søndag"},null,0,0,null,0,"",null,null,"",null,0,"00:00:00","","00:00:00","00:00:00","00:00:00","00:00:00","00:00:00","00:00:00",0,0,0,0,0,"07:30:00","00:00:00",0,1]
["2019-09-09",{"$f":"IF(WEEKDAY(A18,2)=1,WEEKNUM(A17)*-1-MENY!$I$12,IF(WEEKDAY(A17,2)<7,LOOKUP(WEEKDAY(A17,2),MENY!$P$8:$P$14,MENY!$Q$8:$Q$14),\"\"))","v":"Man"},null,null,null,null,"",0,{"$f":"IF(H17=11,\"Ordinær +\",IF(T17=1,IF(H17>0,LOOKUP(H17,MENY!$N$2:O26,MENY!$O$2:$O$18),IF(C17>0,IF(B17=\"Lør\",\"-\",\"Ordinær\"),\"-\")),\"Søndag\"))","v":"-"},null,0,0,null,0,"",null,null,"",null,1,"00:00:00",0,"00:00:00","00:00:00","00:00:00","00:00:00","00:00:00","00:00:00",0,0,0,0,0,"07:30:00","00:00:00",0,1]
["2019-09-10",{"$f":"IF(WEEKDAY(A19,2)=1,WEEKNUM(A18)*-1-MENY!$I$12,IF(WEEKDAY(A18,2)<7,LOOKUP(WEEKDAY(A18,2),MENY!$P$8:$P$14,MENY!$Q$8:$Q$14),\"\"))","v":"Tirs"},null,null,null,null,"",0,{"$f":"IF(H18=11,\"Ordinær +\",IF(T18=1,IF(H18>0,LOOKUP(H18,MENY!$N$2:O27,MENY!$O$2:$O$18),IF(C18>0,IF(B18=\"Lør\",\"-\",\"Ordinær\"),\"-\")),\"Søndag\"))","v":"-"},null,0,0,null,0,"",null,null,"",null,1,"00:00:00",0,"00:00:00","00:00:00","00:00:00","00:00:00","00:00:00","00:00:00",0,0,0,0,0,"07:30:00","00:00:00",0,1]
["2019-09-11",{"$f":"IF(WEEKDAY(A20,2)=1,WEEKNUM(A19)*-1-MENY!$I$12,IF(WEEKDAY(A19,2)<7,LOOKUP(WEEKDAY(A19,2),MENY!$P$8:$P$14,MENY!$Q$8:$Q$14),\"\"))","v":"Ons"},null,null,null,null,"",0,{"$f":"IF(H19=11,\"Ordinær +\",IF(T19=1,IF(H19>0,LOOKUP(H19,MENY!$N$2:O28,MENY!$O$2:$O$18),IF(C19>0,IF(B19=\"Lør\",\"-\",\"Ordinær\"),\"-\")),\"Søndag\"))","v":"-"},null,0,0,null,0,"",null,null,"",null,1,"00:00:00",0,"00:00:00","00:00:00","00:00:00","00:00:00","00:00:00","00:00:00",0,0,0,0,0,"07:30:00","00:00:00",0,1]
["2019-09-12",{"$f":"IF(WEEKDAY(A21,2)=1,WEEKNUM(A20)*-1-MENY!$I$12,IF(WEEKDAY(A20,2)<7,LOOKUP(WEEKDAY(A20,2),MENY!$P$8:$P$14,MENY!$Q$8:$Q$14),\"\"))","v":"Tors"},null,null,null,null,"",0,{"$f":"IF(H20=11,\"Ordinær +\",IF(T20=1,IF(H20>0,LOOKUP(H20,MENY!$N$2:O29,MENY!$O$2:$O$18),IF(C20>0,IF(B20=\"Lør\",\"-\",\"Ordinær\"),\"-\")),\"Søndag\"))","v":"-"},null,0,0,null,0,"",null,null,"",null,1,"00:00:00",0,"00:00:00","00:00:00","00:00:00","00:00:00","00:00:00","00:00:00",0,0,0,0,0,"07:30:00","00:00:00",0,1]
["2019-09-13",{"$f":"IF(WEEKDAY(A22,2)=1,WEEKNUM(A21)*-1-MENY!$I$12,IF(WEEKDAY(A21,2)<7,LOOKUP(WEEKDAY(A21,2),MENY!$P$8:$P$14,MENY!$Q$8:$Q$14),\"\"))","v":"Fre"},null,null,null,null,"",0,{"$f":"IF(H21=11,\"Ordinær +\",IF(T21=1,IF(H21>0,LOOKUP(H21,MENY!$N$2:O30,MENY!$O$2:$O$18),IF(C21>0,IF(B21=\"Lør\",\"-\",\"Ordinær\"),\"-\")),\"Søndag\"))","v":"-"},null,0,0,null,0,"",null,null,"",null,1,"00:00:00",0,"00:00:00","00:00:00","00:00:00","00:00:00","00:00:00","00:00:00",0,0,0,0,0,"07:30:00","00:00:00",0,1]
["2019-09-14",{"$f":"IF(WEEKDAY(A23,2)=1,WEEKNUM(A22)*-1-MENY!$I$12,IF(WEEKDAY(A22,2)<7,LOOKUP(WEEKDAY(A22,2),MENY!$P$8:$P$14,MENY!$Q$8:$Q$14),\"\"))","v":"Lør"},null,null,null,null,"00:00:00",0,{"$f":"IF(H22=11,\"Ordinær +\",IF(T22=1,IF(H22>0,LOOKUP(H22,MENY!$N$2:O31,MENY!$O$2:$O$18),IF(C22>0,IF(B22=\"Lør\",\"-\",\"Ordinær\"),\"-\")),\"Søndag\"))","v":"-"},null,0,0,null,0,"",null,null,"",null,1,"","","00:00:00","","","","","",0,0,0,0,0,"07:30:00","00:00:00",0,1]
["2019-09-15",{"$f":"IF(WEEKDAY(A24,2)=1,WEEKNUM(A23)*-1-MENY!$I$12,IF(WEEKDAY(A23,2)<7,LOOKUP(WEEKDAY(A23,2),MENY!$P$8:$P$14,MENY!$Q$8:$Q$14),\"\"))","v":-38},null,null,null,null,"",0,{"$f":"IF(H23=11,\"Ordinær +\",IF(T23=1,IF(H23>0,LOOKUP(H23,MENY!$N$2:O32,MENY!$O$2:$O$18),IF(C23>0,IF(B23=\"Lør\",\"-\",\"Ordinær\"),\"-\")),\"Søndag\"))","v":"Søndag"},null,0,0,null,0,"",null,null,"",null,0,"00:00:00","","00:00:00","00:00:00","00:00:00","00:00:00","00:00:00","00:00:00",0,0,0,0,0,"07:30:00","00:00:00",0,1]
["2019-09-16",{"$f":"IF(WEEKDAY(A25,2)=1,WEEKNUM(A24)*-1-MENY!$I$12,IF(WEEKDAY(A24,2)<7,LOOKUP(WEEKDAY(A24,2),MENY!$P$8:$P$14,MENY!$Q$8:$Q$14),\"\"))","v":"Man"},null,null,null,null,"",0,{"$f":"IF(H24=11,\"Ordinær +\",IF(T24=1,IF(H24>0,LOOKUP(H24,MENY!$N$2:O33,MENY!$O$2:$O$18),IF(C24>0,IF(B24=\"Lør\",\"-\",\"Ordinær\"),\"-\")),\"Søndag\"))","v":"-"},null,0,0,null,0,"",null,null,"",null,1,"00:00:00",0,"00:00:00","00:00:00","00:00:00","00:00:00","00:00:00","00:00:00",0,0,0,0,0,"07:30:00","00:00:00",0,1]
["2019-09-17",{"$f":"IF(WEEKDAY(A26,2)=1,WEEKNUM(A25)*-1-MENY!$I$12,IF(WEEKDAY(A25,2)<7,LOOKUP(WEEKDAY(A25,2),MENY!$P$8:$P$14,MENY!$Q$8:$Q$14),\"\"))","v":"Tirs"},null,null,null,null,"",0,{"$f":"IF(H25=11,\"Ordinær +\",IF(T25=1,IF(H25>0,LOOKUP(H25,MENY!$N$2:O34,MENY!$O$2:$O$18),IF(C25>0,IF(B25=\"Lør\",\"-\",\"Ordinær\"),\"-\")),\"Søndag\"))","v":"-"},null,0,0,null,0,"",null,null,"",null,1,"00:00:00",0,"00:00:00","00:00:00","00:00:00","00:00:00","00:00:00","00:00:00",0,0,0,0,0,"07:30:00","00:00:00",0,{"$f":"AK24","v":1}]
["2019-09-18",{"$f":"IF(WEEKDAY(A27,2)=1,WEEKNUM(A26)*-1-MENY!$I$12,IF(WEEKDAY(A26,2)<7,LOOKUP(WEEKDAY(A26,2),MENY!$P$8:$P$14,MENY!$Q$8:$Q$14),\"\"))","v":"Ons"},null,null,null,null,"",0,{"$f":"IF(H26=11,\"Ordinær +\",IF(T26=1,IF(H26>0,LOOKUP(H26,MENY!$N$2:O35,MENY!$O$2:$O$18),IF(C26>0,IF(B26=\"Lør\",\"-\",\"Ordinær\"),\"-\")),\"Søndag\"))","v":"-"},null,0,0,null,0,"",null,null,"",null,1,"00:00:00",0,"00:00:00","00:00:00","00:00:00","00:00:00","00:00:00","00:00:00",0,0,0,0,0,"07:30:00","00:00:00",0,1]
["2019-09-19",{"$f":"IF(WEEKDAY(A28,2)=1,WEEKNUM(A27)*-1-MENY!$I$12,IF(WEEKDAY(A27,2)<7,LOOKUP(WEEKDAY(A27,2),MENY!$P$8:$P$14,MENY!$Q$8:$Q$14),\"\"))","v":"Tors"},null,null,null,null,"",0,{"$f":"IF(H27=11,\"Ordinær +\",IF(T27=1,IF(H27>0,LOOKUP(H27,MENY!$N$2:O36,MENY!$O$2:$O$18),IF(C27>0,IF(B27=\"Lør\",\"-\",\"Ordinær\"),\"-\")),\"Søndag\"))","v":"-"},null,0,0,null,0,"",null,null,"",null,1,"00:00:00",0,"00:00:00","00:00:00","00:00:00","00:00:00","00:00:00","00:00:00",0,0,0,0,0,"07:30:00","00:00:00",0,1]
["2019-09-20",{"$f":"IF(WEEKDAY(A29,2)=1,WEEKNUM(A28)*-1-MENY!$I$12,IF(WEEKDAY(A28,2)<7,LOOKUP(WEEKDAY(A28,2),MENY!$P$8:$P$14,MENY!$Q$8:$Q$14),\"\"))","v":"Fre"},null,null,null,null,"",0,{"$f":"IF(H28=11,\"Ordinær +\",IF(T28=1,IF(H28>0,LOOKUP(H28,MENY!$N$2:O37,MENY!$O$2:$O$18),IF(C28>0,IF(B28=\"Lør\",\"-\",\"Ordinær\"),\"-\")),\"Søndag\"))","v":"-"},null,0,0,null,0,"",null,null,"",null,1,"00:00:00",0,"00:00:00","00:00:00","00:00:00","00:00:00","00:00:00","00:00:00",0,0,0,0,0,"07:30:00","00:00:00",0,1]
["2019-09-21",{"$f":"IF(WEEKDAY(A30,2)=1,WEEKNUM(A29)*-1-MENY!$I$12,IF(WEEKDAY(A29,2)<7,LOOKUP(WEEKDAY(A29,2),MENY!$P$8:$P$14,MENY!$Q$8:$Q$14),\"\"))","v":"Lør"},null,null,null,null,"00:00:00",0,{"$f":"IF(H29=11,\"Ordinær +\",IF(T29=1,IF(H29>0,LOOKUP(H29,MENY!$N$2:O38,MENY!$O$2:$O$18),IF(C29>0,IF(B29=\"Lør\",\"-\",\"Ordinær\"),\"-\")),\"Søndag\"))","v":"-"},null,0,0,null,0,"",null,null,"",null,1,"","","00:00:00","","","","","",0,0,0,0,0,"07:30:00","00:00:00",0,1]
["2019-09-22",{"$f":"IF(WEEKDAY(A31,2)=1,WEEKNUM(A30)*-1-MENY!$I$12,IF(WEEKDAY(A30,2)<7,LOOKUP(WEEKDAY(A30,2),MENY!$P$8:$P$14,MENY!$Q$8:$Q$14),\"\"))","v":-39},null,null,null,null,"",0,{"$f":"IF(H30=11,\"Ordinær +\",IF(T30=1,IF(H30>0,LOOKUP(H30,MENY!$N$2:O39,MENY!$O$2:$O$18),IF(C30>0,IF(B30=\"Lør\",\"-\",\"Ordinær\"),\"-\")),\"Søndag\"))","v":"Søndag"},null,0,0,null,0,"",null,null,"",null,0,"00:00:00","","00:00:00","00:00:00","00:00:00","00:00:00","00:00:00","00:00:00",0,0,0,0,0,"07:30:00","00:00:00",0,1]
["2019-09-23",{"$f":"IF(WEEKDAY(A32,2)=1,WEEKNUM(A31)*-1-MENY!$I$12,IF(WEEKDAY(A31,2)<7,LOOKUP(WEEKDAY(A31,2),MENY!$P$8:$P$14,MENY!$Q$8:$Q$14),\"\"))","v":"Man"},null,null,null,null,"",0,{"$f":"IF(H31=11,\"Ordinær +\",IF(T31=1,IF(H31>0,LOOKUP(H31,MENY!$N$2:O40,MENY!$O$2:$O$18),IF(C31>0,IF(B31=\"Lør\",\"-\",\"Ordinær\"),\"-\")),\"Søndag\"))","v":"-"},null,0,0,null,0,"",null,null,"",null,1,"00:00:00",0,"00:00:00","00:00:00","00:00:00","00:00:00","00:00:00","00:00:00",0,0,0,0,0,"07:30:00","00:00:00",0,1]
["2019-09-24",{"$f":"IF(WEEKDAY(A33,2)=1,WEEKNUM(A32)*-1-MENY!$I$12,IF(WEEKDAY(A32,2)<7,LOOKUP(WEEKDAY(A32,2),MENY!$P$8:$P$14,MENY!$Q$8:$Q$14),\"\"))","v":"Tirs"},null,null,null,null,"",0,{"$f":"IF(H32=11,\"Ordinær +\",IF(T32=1,IF(H32>0,LOOKUP(H32,MENY!$N$2:O41,MENY!$O$2:$O$18),IF(C32>0,IF(B32=\"Lør\",\"-\",\"Ordinær\"),\"-\")),\"Søndag\"))","v":"-"},null,0,0,null,0,"",null,null,"",null,1,"00:00:00",0,"00:00:00","00:00:00","00:00:00","00:00:00","00:00:00","00:00:00",0,0,0,0,0,"07:30:00","00:00:00",0,1]
["2019-09-25",{"$f":"IF(WEEKDAY(A34,2)=1,WEEKNUM(A33)*-1-MENY!$I$12,IF(WEEKDAY(A33,2)<7,LOOKUP(WEEKDAY(A33,2),MENY!$P$8:$P$14,MENY!$Q$8:$Q$14),\"\"))","v":"Ons"},null,null,null,null,"",0,{"$f":"IF(H33=11,\"Ordinær +\",IF(T33=1,IF(H33>0,LOOKUP(H33,MENY!$N$2:O42,MENY!$O$2:$O$18),IF(C33>0,IF(B33=\"Lør\",\"-\",\"Ordinær\"),\"-\")),\"Søndag\"))","v":"-"},null,0,0,null,0,"",null,null,"",null,1,"00:00:00",0,"00:00:00","00:00:00","00:00:00","00:00:00","00:00:00","00:00:00",0,0,0,0,0,"07:30:00","00:00:00",0,1]
["2019-09-26",{"$f":"IF(WEEKDAY(A35,2)=1,WEEKNUM(A34)*-1-MENY!$I$12,IF(WEEKDAY(A34,2)<7,LOOKUP(WEEKDAY(A34,2),MENY!$P$8:$P$14,MENY!$Q$8:$Q$14),\"\"))","v":"Tors"},null,null,null,null,"",0,{"$f":"IF(H34=11,\"Ordinær +\",IF(T34=1,IF(H34>0,LOOKUP(H34,MENY!$N$2:O43,MENY!$O$2:$O$18),IF(C34>0,IF(B34=\"Lør\",\"-\",\"Ordinær\"),\"-\")),\"Søndag\"))","v":"-"},null,0,0,null,0,"",null,null,"",null,1,"00:00:00",0,"00:00:00","00:00:00","00:00:00","00:00:00","00:00:00","00:00:00",0,0,0,0,0,"07:30:00","00:00:00",0,1]
["2019-09-27",{"$f":"IF(WEEKDAY(A36,2)=1,WEEKNUM(A35)*-1-MENY!$I$12,IF(WEEKDAY(A35,2)<7,LOOKUP(WEEKDAY(A35,2),MENY!$P$8:$P$14,MENY!$Q$8:$Q$14),\"\"))","v":"Fre"},null,null,null,null,"",0,{"$f":"IF(H35=11,\"Ordinær +\",IF(T35=1,IF(H35>0,LOOKUP(H35,MENY!$N$2:O44,MENY!$O$2:$O$18),IF(C35>0,IF(B35=\"Lør\",\"-\",\"Ordinær\"),\"-\")),\"Søndag\"))","v":"-"},null,0,0,null,0,"",null,null,"",null,{"$f":"IF(A35>0,IF(WEEKDAY(A35-1)<7,1,0),\"\")","v":1},"00:00:00",0,"00:00:00","00:00:00","00:00:00","00:00:00","00:00:00","00:00:00",0,0,0,0,0,"07:30:00","00:00:00",0,1]
["2019-09-28",{"$f":"IF(WEEKDAY(A37,2)=1,WEEKNUM(A36)*-1-MENY!$I$12,IF(WEEKDAY(A36,2)<7,LOOKUP(WEEKDAY(A36,2),MENY!$P$8:$P$14,MENY!$Q$8:$Q$14),\"\"))","v":"Lør"},null,null,null,null,"00:00:00",0,{"$f":"IF(H36=11,\"Ordinær +\",IF(T36=1,IF(H36>0,LOOKUP(H36,MENY!$N$2:O45,MENY!$O$2:$O$18),IF(C36>0,IF(B36=\"Lør\",\"-\",\"Ordinær\"),\"-\")),\"Søndag\"))","v":"-"},null,0,0,null,0,"",null,null,"",null,{"$f":"IF(A36>0,IF(WEEKDAY(A36-1)<7,1,0),\"\")","v":1},"","","00:00:00","","","","","",0,0,0,0,0,"07:30:00","00:00:00",0,1]
["2019-09-29",{"$f":"IF(WEEKDAY(A38,2)=1,WEEKNUM(A37)*-1-MENY!$I$12,IF(WEEKDAY(A37,2)<7,LOOKUP(WEEKDAY(A37,2),MENY!$P$8:$P$14,MENY!$Q$8:$Q$14),\"\"))","v":-40},null,null,null,null,"",0,{"$f":"IF(H37=11,\"Ordinær +\",IF(T37=1,IF(H37>0,LOOKUP(H37,MENY!$N$2:O46,MENY!$O$2:$O$18),IF(C37>0,IF(B37=\"Lør\",\"-\",\"Ordinær\"),\"-\")),\"Søndag\"))","v":"Søndag"},null,0,0,null,0,"",null,null,"",null,{"$f":"IF(A37>0,IF(WEEKDAY(A37-1)<7,1,0),\"\")","v":0},"00:00:00","","00:00:00","00:00:00","00:00:00","00:00:00","00:00:00","00:00:00",0,0,0,0,0,"07:30:00","00:00:00",0,1]
["2019-09-30",{"$f":"IF(WEEKDAY(A39,2)=1,WEEKNUM(A38)*-1-MENY!$I$12,IF(WEEKDAY(A38,2)<7,LOOKUP(WEEKDAY(A38,2),MENY!$P$8:$P$14,MENY!$Q$8:$Q$14),\"\"))","v":"Man"},null,null,null,null,"",0,{"$f":"IF(H38=11,\"Ordinær +\",IF(T38=1,IF(H38>0,LOOKUP(H38,MENY!$N$2:O47,MENY!$O$2:$O$18),IF(C38>0,IF(B38=\"Lør\",\"-\",\"Ordinær\"),\"-\")),\"Søndag\"))","v":"-"},null,0,0,null,0,"",null,null,"",null,{"$f":"IF(A38>0,IF(WEEKDAY(A38-1)<7,1,0),\"\")","v":1},"00:00:00",0,"00:00:00","00:00:00","00:00:00","00:00:00","00:00:00","00:00:00",0,0,0,0,0,"07:30:00","00:00:00",0,1]
[null,{"$f":"IF(WEEKDAY(A40,2)=1,WEEKNUM(A39)*-1-MENY!$I$12,IF(WEEKDAY(A39,2)<7,LOOKUP(WEEKDAY(A39,2),MENY!$P$8:$P$14,MENY!$Q$8:$Q$14),\"\"))","v":"Lør"},null,null,null,null,"00:00:00",0,{"$f":"IF(A39>0,IF(H39=11,\"Ordinær +\",IF(T39=1,IF(H39>0,LOOKUP(H39,MENY!$N$2:O48,MENY!$O$2:$O$18),IF(C39>0,IF(B39=\"Lør\",\"-\",\"Ordinær\"),\"-\")),\"Søndag\")),\"-\")","v":"-"},null,0,0,null,0,"",null,null,"",null,{"$f":"IF(A39>0,IF(WEEKDAY(A39-1)<7,1,0),\"\")","v":""},"","","00:00:00","","","",{"$f":"IF(B39=\"Lør\",\"\",IF(T39=1,IF(H39=9,AH39,0),0))","v":""},"",0,0,0,0,0,"07:30:00","00:00:00",0,1]
[null,null,null,"Sum for denne måned",null,null,{"$f":"SUM(G9:G39)*24","v":0},null,null,null,{"$f":"SUM(K9:K39)+N49","v":0},{"$f":"SUM(L9:L39)","v":0},{"$f":"SUM(M9:M39)","v":0},{"$f":"SUM(N9:N39)-U40-AG41-SUM(K40:M40)+N50","v":0},{"$f":"SUM(O9:O39)","v":0},"Fravær denne måned",null,null,null,null,{"$f":"SUM(U9:U39)*24","v":0},{"$f":"SUM(V9:V39)","v":0},{"$f":"SUM(W9:W39)*24","v":0},0,0,0,0,0,{"$f":"SUM(AC9:AC39)","v":0},{"$f":"SUM(AD9:AD39)","v":0},{"$f":"SUM(AE9:AE39)","v":0},{"$f":"SUM(AF9:AF39)","v":0},{"$f":"SUM(AG9:AG39)","v":0}]
[null,null,null,"Overført fra forrige måned",null,null,null,null,null,null,null,null,null,{"$f":"AUG!N47","v":0},{"$f":"AUG!O42","v":0},"Type","Timer",null,null,null,null,null,null,null,null,null,null,null,null,null,null,"Sum deltidsfravær:",{"$f":"SUM(AC40:AG40)","v":0}]
[null,null,null,"Sum hittil i år",null,null,null,null,null,null,null,null,null,{"$f":"SUM(N40:N41)","v":0},{"$f":"SUM(O40:O41)","v":0},"06 Perm m/lønn",{"$f":"X40+AC40*-1","v":0}]
["Ferieregnskap",null,null,"Dager","Timeregnskap",null,null,null,null,null,null,null,null,"Timer",null,"07 Perm u/lønn",{"$f":"Y40+AD40*-1","v":0}]
["Disponible feriedager",null,null,{"$f":"AUG!D47","v":25},"Opptjent denne måneden",null,null,null,null,null,null,null,null,{"$f":"SUM(N9:N39)-AG41-(SUM(K40:M40))+N50","v":0},null,"08 Sykemelding",{"$f":"(Z40+AE40*-1)","v":0}]
["Brukt denne måned",null,null,{"$f":"V40*-1","v":0},"Avspasert denne måneden",null,null,null,null,null,null,null,null,{"$f":"U40","v":0},null,"09 Egenmelding",{"$f":"(AA40+AF40*-1)","v":0}]
["Endring i feriedager",null,null,null,"Utbetalt overtid denne måned",null,null,null,null,null,null,null,null,{"$f":"SUM(K40:M40)","v":0},null,"10 Sykt barn",{"$f":"(AB40+AG40*-1)","v":0}]
["Til gode",null,null,{"$f":"SUM(D44:D46)","v":25},"Til gode for avspasering",null,null,null,null,null,null,null,null,{"$f":"N42","v":0},null,"Sum-September",{"$f":"SUM(Q42:Q46)","v":0}]
[null,null,null,null,"Effektiv arbeidstid denne måned",null,null,null,null,null,null,null,null,{"$f":"G40+N44+AG41+N46-N50","v":0},null,"Hittil i år",{"$f":"Q47+AUG!Q48","v":0}]
[null,null,null,null,"Flexitid omgjort til overtid og utbetalt, denne måned"]
[null,null,null,null,"Annen korrigering av flexitid, OBS! skriv egen merknad"]
["Merknader"]
[]
[]
[]
[]
[]
["Overtid for utbetaling:",null,null,null,null,null,"Dato",null,null,null,null,null,null,null,"Dato"]
[null,null,null,"Timer med 50% tillegg :",{"$f":"K40","v":0}]
[null,null,null,"Timer med 100% tillegg:",{"$f":"L40","v":0}]
[null,null,null,"Timer med 133% tillegg:",{"$f":"M39","v":0},null,null,null,"Attestert",null,null,null,null,null,"Anvist"]
[]
[]
[null,null,null,null,null,null,null,null,null,null,null,null,null,null,null,{"$f":"MENY!D6","v":"Leder"}]
["© Ole Jørgen Klaussen - 2003",null,null,null,{"$f":"TODAY()","v":"2018-11-30"},{"$f":"YEAR(TODAY())","v":2018},null,null,null,null,null,null,null,null,null,null,"ole.klaussen@online.no"]

{"sheet":"OKT","index":10,"n_rows":64,"n_cols":37,"rows_kept":64,"cut":false,"hidden":false,"merged":[[18,15,18,16],[16,15,16,16],[12,15,12,16],[13,15,13,16],[14,15,14,16],[15,15,15,16],[17,15,17,16],[38,15,38,16],[36,15,36,16],[37,15,37,16],[27,15,27,16],[28,15,28,16],[29,15,29,16],[30,15,30,16],[10,15,10,16],[6,3,6,4],[7,7,7,8],[5,7,6,16],[2,15,2,16],[5,19,5,22],[7,15,7,16],[2,1,2,6],[8,15,8,16],[9,15,9,16],[19,15,19,16],[31,15,31,16],[32,15,32,16],[33,15,33,16],[34,15,34,16],[20,15,20,16],[21,15,21,16],[22,15,22,16],[1,28,2,33],[59,14,59,16],[62,6,62,10],[55,0,55,16],[56,6,56,10],[56,14,56,16],[51,0,51,16],[52,0,52,16],[53,0,53,16],[54,0,54,16],[35,15,35,16],[23,15,23,16],[24,15,24,16],[11,15,11,16],[25,15,25,16],[26,15,26,16]]}
["Meny","JAN","FEB","MAR","APR","MAI","JUN",null,null,null,null,null,null,null,null,null,"Hjelp","Viktig når det gjelder overtid"]
["Året","JUL","AUG","SEP","OKT","NOV","DES",null,null,null,null,null,null,null,null,"Dato",null,"For at føringer av aktiv arbeidstid skal bli riktig"]
[null,{"$f":"MENY!D4","v":"Min bedrift"},null,null,null,null,null,null,"Oktober -",null,null,null,null,{"$f":"MENY!P1","v":2019},null,{"$f":"TODAY()","v":"2018-11-30"},null,"er det nødvendig at all arbeidstid registreres."]
[null,"Timeliste","Navn:",{"$f":"MENY!D5","v":"Min timeliste"},null,null,"Sommer",null,null,null,"Stillingsbrøk:",{"$f":"MENY!I5","v":1},null,"Vinter",null,null,null,"Dette gjelder også overtid. Så registrer  når du ",null,null,null,null,null,null,null,null,null,null,null,null,null,null,null,null,null,"MERK!"]
[null,null,"Sommerlukking fra/til:",null,{"$f":"MENY!Q18","v":"2019-05-15"},{"$f":"MENY!Q19","v":"2019-09-14"},{"$f":"(MENY!F13-MENY!E13-MENY!I13)*MENY!I5","v":"07:30:00"},null,{"$f":"MENY!I13","v":"00:00:00"},"  <-arbeidstid->",null,null,{"$f":"MENY!I14","v":"00:00:00"},{"$f":"(MENY!F14-MENY!E14-MENY!I14)*MENY!I5","v":"07:30:00"},null,null,null,"kommer på jobb (inn) og når du er ferdig (ut)",null,null,null,null,null,null,null,null,null,null,null,null,null,null,null,null,null,"Les her"]
["År ",null,null,null,null,null,null,"Fyll ut i arbeids og fraværskode : 0=ordinær  1=Avspasere  2=Ferie  3=Tjeneste  4=Plussdag  5=Helligdag  6=Perm M/lønn  7=Perm U/lønn  8=Sykemelding  9=Egenmelding 10=Sykt barn 11=Ordinær+ , 12 = plusstid som overtid",null,null,null,null,null,null,null,null,null,"Dersom noe av tiden skal utbetales i overtid, så",null,"Arbeidsdata",null,null,null,null,null,null,null,null,6,7,8,9,10,null,null,"Syke-","Stillings"]
[{"$f":"N3","v":2019},{"$f":"WEEKNUM(A9)+MENY!I12","v":40},"I dag","Fravær pr dag",null,"I dag",null,null,null,null,null,null,null,null,null,null,null,"legg inn antall timer nederst på arket.",null,null,null,null,null,6,7,8,9,10,12,13,14,15,16,null,null,"melding","brøk"]
["DATO","UKENR                               og DAG","Inn","Ut","Inn","Ut","Ordinær","Arbeids og fraværskode",null,"Fravær",0.5,1,1.33,"Balanse","Timer i dag","Merknad ",null,"Huskeliste",null,"Arbeids dag","Avsp","Ferie","Tjeneste","Perm m-lønn","Perm u-lønn","Sykemelding","Egenmelding","Sykt barn","Perm m-lønn","Perm u-lønn","Sykemelding","Egenmelding","Sykt barn","Ordinær arbeidstid","Trekk for matpause","i prosent andel"]
[{"$f":"DATE(MENY!P1,10,1)","v":"2019-10-01"},{"$f":"IF(WEEKDAY(A10,2)=1,WEEKNUM(A9)*-1-MENY!$I$12,IF(WEEKDAY(A9,2)<7,LOOKUP(WEEKDAY(A9,2),MENY!$P$8:$P$14,MENY!$Q$8:$Q$14),\"\"))","v":"Tirs"},null,null,null,null,{"$f":"IF(H9=11,F9-C9-(E9-D9),IF(B9=\"Lør\",0,IF(H9=4,0,IF(H9=3,IF(T9>0,W9,\"\"),IF(H9=1,0, IF(C9>0,  AH9,       \"\"))))))","v":""},{"$f":"IF(B9=\"Lør\",IF(C9>0,4,0),0)","v":0},{"$f":"IF(H9=11,\"Ordinær +\",IF(T9=1,IF(H9>0,LOOKUP(H9,MENY!$N$2:O18,MENY!$O$2:$O$18),IF(C9>0,IF(B9=\"Lør\",\"-\",\"Ordinær\"),\"-\")),\"Søndag\"))","v":"-"},null,{"$f":"IF(H9=12,IF(N9>=4,4,N9),0)","v":0},{"$f":"IF(H9=12,IF(N9>K9,N9-4,0),0)","v":0},null,{"$f":"IF(H9=11,0,IF(T9=1,IF(H9=4,((F9-C9)-(E9-D9))*24,IF(C9>0,(F9-C9-(E9-D9)-G9-AI9)*24,0)),0))","v":0},{"$f":"IF(F9>0,G9*24+N9,\"\")","v":""},null,null,{"$f":"IF(O9=\"\",\"\",\"Husk, fordel timer til prosjekter\")","v":""},null,{"$f":"IF(WEEKDAY(A9-1)<7,1,0)","v":1},{"$f":"IF(B9=\"Lør\",\"\",IF(T9=1,IF(H9=1,AH9,0),0))","v":"00:00:00"},{"$f":"IF(T9=1,IF(B9=\"lør\",\"\",IF(H9=2,1,0)),\"\")","v":0},{"$f":"IF(T9=1,IF(H9=3,AH9,0),0)","v":"00:00:00"},{"$f":"IF(B9=\"lør\",\"\",IF(T9=1,IF(H9=6,AH9,0),0))","v":"00:00:00"},{"$f":"IF(B9=\"Lør\",\"\",IF(T9=1,IF(H9=7,AH9,0),0))","v":"00:00:00"},{"$f":"IF(AJ9>0,IF(C9>0,    (AH9*AJ9)/(1-AJ9),0),           IF(B9=\"Lør\",\"\",IF(T9=1,IF(H9=8,AH9,0),0)))","v":"00:00:00"},{"$f":"IF(B9=\"Lør\",\"\",IF(T9=1,IF(H9=9,AH9,0),0))","v":"00:00:00"},{"$f":"IF(B9=\"Lør\",\"\",IF(T9=1,IF(H9=10,AH9,0),0))","v":"00:00:00"},{"$f":"IF(J9=6,N9,0)","v":0},{"$f":"IF(J9=7,N9,0)","v":0},{"$f":"IF(J9=8,N9,0)","v":0},{"$f":"IF(J9=9,N9,0)","v":0},{"$f":"IF(J9=10,N9,0)","v":0},{"$f":"((IF(A9<$F$5+1,IF(A9>$E$5-1,$G$5,$N$5),$N$5))*(1-AJ9))*(AK9)","v":"07:30:00"},{"$f":"IF(A9<$F$5+1,IF(A9>$E$5-1,$I$5,$M$5),$M$5)","v":"00:00:00"},{"$f":"SEP!AJ39","v":0},{"$f":"SEP!AK39","v":1}]
[{"$f":"A9+1","v":"2019-10-02"},{"$f":"IF(WEEKDAY(A11,2)=1,WEEKNUM(A10)*-1-MENY!$I$12,IF(WEEKDAY(A10,2)<7,LOOKUP(WEEKDAY(A10,2),MENY!$P$8:$P$14,MENY!$Q$8:$Q$14),\"\"))","v":"Ons"},null,null,null,null,{"$f":"IF(H10=11,F10-C10-(E10-D10),IF(B10=\"Lør\",0,IF(H10=4,0,IF(H10=3,IF(T10>0,W10,\"\"),IF(H10=1,0, IF(C10>0,  AH10,       \"\"))))))","v":""},0,{"$f":"IF(H10=11,\"Ordinær +\",IF(T10=1,IF(H10>0,LOOKUP(H10,MENY!$N$2:O19,MENY!$O$2:$O$18),IF(C10>0,IF(B10=\"Lør\",\"-\",\"Ordinær\"),\"-\")),\"Søndag\"))","v":"-"},null,{"$f":"IF(H10=12,IF(N10>=4,4,N10),0)","v":0},{"$f":"IF(H10=12,IF(N10>K10,N10-4,0),0)","v":0},null,{"$f":"IF(H10=11,0,IF(T10=1,IF(H10=4,((F10-C10)-(E10-D10))*24,IF(C10>0,(F10-C10-(E10-D10)-G10-AI10)*24,0)),0))","v":0},{"$f":"IF(F10>0,G10*24+N10,\"\")","v":""},null,null,{"$f":"IF(O10=\"\",\"\",\"Husk, fordel timer til prosjekter\")","v":""},null,{"$f":"IF(WEEKDAY(A10-1)<7,1,0)","v":1},{"$f":"IF(B10=\"Lør\",\"\",IF(T10=1,IF(H10=1,AH10,0),0))","v":"00:00:00"},0,{"$f":"IF(T10=1,IF(H10=3,AH10,0),0)","v":"00:00:00"},{"$f":"IF(B10=\"lør\",\"\",IF(T10=1,IF(H10=6,AH10,0),0))","v":"00:00:00"},{"$f":"IF(B10=\"Lør\",\"\",IF(T10=1,IF(H10=7,AH10,0),0))","v":"00:00:00"},{"$f":"IF(AJ10>0,IF(C10>0,    (AH10*AJ10)/(1-AJ10),0),           IF(B10=\"Lør\",\"\",IF(T10=1,IF(H10=8,AH10,0),0)))","v":"00:00:00"},{"$f":"IF(B10=\"Lør\",\"\",IF(T10=1,IF(H10=9,AH10,0),0))","v":"00:00:00"},{"$f":"IF(B10=\"Lør\",\"\",IF(T10=1,IF(H10=10,AH10,0),0))","v":"00:00:00"},0,0,0,0,0,{"$f":"((IF(A10<$F$5+1,IF(A10>$E$5-1,$G$5,$N$5),$N$5))*(1-AJ10))*(AK10)","v":"07:30:00"},{"$f":"IF(A10<$F$5+1,IF(A10>$E$5-1,$I$5,$M$5),$M$5)","v":"00:00:00"},{"$f":"AJ9","v":0},{"$f":"AK9","v":1}]
[{"$f":"A10+1","v":"2019-10-03"},{"$f":"IF(WEEKDAY(A12,2)=1,WEEKNUM(A11)*-1-MENY!$I$12,IF(WEEKDAY(A11,2)<7,LOOKUP(WEEKDAY(A11,2),MENY!$P$8:$P$14,MENY!$Q$8:$Q$14),\"\"))","v":"Tors"},null,null,null,null,{"$f":"IF(H11=11,F11-C11-(E11-D11),IF(B11=\"Lør\",0,IF(H11=4,0,IF(H11=3,IF(T11>0,W11,\"\"),IF(H11=1,0, IF(C11>0,  AH11,       \"\"))))))","v":""},0,{"$f":"IF(H11=11,\"Ordinær +\",IF(T11=1,IF(H11>0,LOOKUP(H11,MENY!$N$2:O20,MENY!$O$2:$O$18),IF(C11>0,IF(B11=\"Lør\",\"-\",\"Ordinær\"),\"-\")),\"Søndag\"))","v":"-"},null,0,0,null,0,"",null,null,"",null,1,"00:00:00",0,"00:00:00","00:00:00","00:00:00","00:00:00","00:00:00","00:00:00",0,0,0,0,0,"07:30:00","00:00:00",{"$f":"AJ10","v":0},{"$f":"AK10","v":1}]
["2019-10-04",{"$f":"IF(WEEKDAY(A13,2)=1,WEEKNUM(A12)*-1-MENY!$I$12,IF(WEEKDAY(A12,2)<7,LOOKUP(WEEKDAY(A12,2),MENY!$P$8:$P$14,MENY!$Q$8:$Q$14),\"\"))","v":"Fre"},null,null,null,null,"",0,{"$f":"IF(H12=11,\"Ordinær +\",IF(T12=1,IF(H12>0,LOOKUP(H12,MENY!$N$2:O21,MENY!$O$2:$O$18),IF(C12>0,IF(B12=\"Lør\",\"-\",\"Ordinær\"),\"-\")),\"Søndag\"))","v":"-"},null,0,0,null,0,"",null,null,"",null,1,"00:00:00",0,"00:00:00","00:00:00","00:00:00","00:00:00","00:00:00","00:00:00",0,0,0,0,0,"07:30:00","00:00:00",0,1]
["2019-10-05",{"$f":"IF(WEEKDAY(A14,2)=1,WEEKNUM(A13)*-1-MENY!$I$12,IF(WEEKDAY(A13,2)<7,LOOKUP(WEEKDAY(A13,2),MENY!$P$8:$P$14,MENY!$Q$8:$Q$14),\"\"))","v":"Lør"},null,null,null,null,"00:00:00",0,{"$f":"IF(H13=11,\"Ordinær +\",IF(T13=1,IF(H13>0,LOOKUP(H13,MENY!$N$2:O22,MENY!$O$2:$O$18),IF(C13>0,IF(B13=\"Lør\",\"-\",\"Ordinær\"),\"-\")),\"Søndag\"))","v":"-"},null,0,0,null,0,"",null,null,"",null,1,"","","00:00:00","","","","","",0,0,0,0,0,"07:30:00","00:00:00",0,1]
["2019-10-06",{"$f":"IF(WEEKDAY(A15,2)=1,WEEKNUM(A14)*-1-MENY!$I$12,IF(WEEKDAY(A14,2)<7,LOOKUP(WEEKDAY(A14,2),MENY!$P$8:$P$14,MENY!$Q$8:$Q$14),\"\"))","v":-41},null,null,null,null,"",0,{"$f":"IF(H14=11,\"Ordinær +\",IF(T14=1,IF(H14>0,LOOKUP(H14,MENY!$N$2:O23,MENY!$O$2:$O$18),IF(C14>0,IF(B14=\"Lør\",\"-\",\"Ordinær\"),\"-\")),\"Søndag\"))","v":"Søndag"},null,0,0,null,0,"",null,null,"",null,0,"00:00:00","","00:00:00","00:00:00","00:00:00","00:00:00","00:00:00","00:00:00",0,0,0,0,0,"07:30:00","00:00:00",0,1]
["2019-10-07",{"$f":"IF(WEEKDAY(A16,2)=1,WEEKNUM(A15)*-1-MENY!$I$12,IF(WEEKDAY(A15,2)<7,LOOKUP(WEEKDAY(A15,2),MENY!$P$8:$P$14,MENY!$Q$8:$Q$14),\"\"))","v":"Man"},null,null,null,null,"",0,{"$f":"IF(H15=11,\"Ordinær +\",IF(T15=1,IF(H15>0,LOOKUP(H15,MENY!$N$2:O24,MENY!$O$2:$O$18),IF(C15>0,IF(B15=\"Lør\",\"-\",\"Ordinær\"),\"-\")),\"Søndag\"))","v":"-"},null,0,0,null,0,"",null,null,"",null,1,"00:00:00",0,"00:00:00","00:00:00","00:00:00","00:00:00","00:00:00","00:00:00",0,0,0,0,0,"07:30:00","00:00:00",0,1]
["2019-10-08",{"$f":"IF(WEEKDAY(A17,2)=1,WEEKNUM(A16)*-1-MENY!$I$12,IF(WEEKDAY(A16,2)<7,LOOKUP(WEEKDAY(A16,2),MENY!$P$8:$P$14,MENY!$Q$8:$Q$14),\"\"))","v":"Tirs"},null,null,null,null,"",0,{"$f":"IF(H16=11,\"Ordinær +\",IF(T16=1,IF(H16>0,LOOKUP(H16,MENY!$N$2:O25,MENY!$O$2:$O$18),IF(C16>0,IF(B16=\"Lør\",\"-\",\"Ordinær\"),\"-\")),\"Søndag\"))","v":"-"},null,0,0,null,0,"",null,null,"",null,1,"00:00:00",0,"00:00:00","00:00:00","00:00:00","00:00:00","00:00:00","00:00:00",0,0,0,0,0,"07:30:00","00:00:00",0,1]
["2019-10-09",{"$f":"IF(WEEKDAY(A18,2)=1,WEEKNUM(A17)*-1-MENY!$I$12,IF(WEEKDAY(A17,2)<7,LOOKUP(WEEKDAY(A17,2),MENY!$P$8:$P$14,MENY!$Q$8:$Q$14),\"\"))","v":"Ons"},null,null,null,null,"",0,{"$f":"IF(H17=11,\"Ordinær +\",IF(T17=1,IF(H17>0,LOOKUP(H17,MENY!$N$2:O26,MENY!$O$2:$O$18),IF(C17>0,IF(B17=\"Lør\",\"-\",\"Ordinær\"),\"-\")),\"Søndag\"))","v":"-"},null,0,0,null,0,"",null,null,"",null,1,"00:00:00",0,"00:00:00","00:00:00","00:00:00","00:00:00","00:00:00","00:00:00",0,0,0,0,0,"07:30:00","00:00:00",0,1]
["2019-10-10",{"$f":"IF(WEEKDAY(A19,2)=1,WEEKNUM(A18)*-1-MENY!$I$12,IF(WEEKDAY(A18,2)<7,LOOKUP(WEEKDAY(A18,2),MENY!$P$8:$P$14,MENY!$Q$8:$Q$14),\"\"))","v":"Tors"},null,null,null,null,"",0,{"$f":"IF(H18=11,\"Ordinær +\",IF(T18=1,IF(H18>0,LOOKUP(H18,MENY!$N$2:O27,MENY!$O$2:$O$18),IF(C18>0,IF(B18=\"Lør\",\"-\",\"Ordinær\"),\"-\")),\"Søndag\"))","v":"-"},null,0,0,null,0,"",null,null,"",null,1,"00:00:00",0,"00:00:00","00:00:00","00:00:00","00:00:00","00:00:00","00:00:00",0,0,0,0,0,"07:30:00","00:00:00",0,1]
["2019-10-11",{"$f":"IF(WEEKDAY(A20,2)=1,WEEKNUM(A19)*-1-MENY!$I$12,IF(WEEKDAY(A19,2)<7,LOOKUP(WEEKDAY(A19,2),MENY!$P$8:$P$14,MENY!$Q$8:$Q$14),\"\"))","v":"Fre"},null,null,null,null,"",0,{"$f":"IF(H19=11,\"Ordinær +\",IF(T19=1,IF(H19>0,LOOKUP(H19,MENY!$N$2:O28,MENY!$O$2:$O$18),IF(C19>0,IF(B19=\"Lør\",\"-\",\"Ordinær\"),\"-\")),\"Søndag\"))","v":"-"},null,0,0,null,0,"",null,null,"",null,1,"00:00:00",0,"00:00:00","00:00:00","00:00:00","00:00:00","00:00:00","00:00:00",0,0,0,0,0,"07:30:00","00:00:00",0,1]
["2019-10-12",{"$f":"IF(WEEKDAY(A21,2)=1,WEEKNUM(A20)*-1-MENY!$I$12,IF(WEEKDAY(A20,2)<7,LOOKUP(WEEKDAY(A20,2),MENY!$P$8:$P$14,MENY!$Q$8:$Q$14),\"\"))","v":"Lør"},null,null,null,null,"00:00:00",0,{"$f":"IF(H20=11,\"Ordinær +\",IF(T20=1,IF(H20>0,LOOKUP(H20,MENY!$N$2:O29,MENY!$O$2:$O$18),IF(C20>0,IF(B20=\"Lør\",\"-\",\"Ordinær\"),\"-\")),\"Søndag\"))","v":"-"},null,0,0,null,0,"",null,null,"",null,1,"","","00:00:00","","","","","",0,0,0,0,0,"07:30:00","00:00:00",0,1]
["2019-10-13",{"$f":"IF(WEEKDAY(A22,2)=1,WEEKNUM(A21)*-1-MENY!$I$12,IF(WEEKDAY(A21,2)<7,LOOKUP(WEEKDAY(A21,2),MENY!$P$8:$P$14,MENY!$Q$8:$Q$14),\"\"))","v":-42},null,null,null,null,"",0,{"$f":"IF(H21=11,\"Ordinær +\",IF(T21=1,IF(H21>0,LOOKUP(H21,MENY!$N$2:O30,MENY!$O$2:$O$18),IF(C21>0,IF(B21=\"Lør\",\"-\",\"Ordinær\"),\"-\")),\"Søndag\"))","v":"Søndag"},null,0,0,null,0,"",null,null,"",null,0,"00:00:00","","00:00:00","00:00:00","00:00:00","00:00:00","00:00:00","00:00:00",0,0,0,0,0,"07:30:00","00:00:00",0,1]
["2019-10-14",{"$f":"IF(WEEKDAY(A23,2)=1,WEEKNUM(A22)*-1-MENY!$I$12,IF(WEEKDAY(A22,2)<7,LOOKUP(WEEKDAY(A22,2),MENY!$P$8:$P$14,MENY!$Q$8:$Q$14),\"\"))","v":"Man"},null,null,null,null,"",0,{"$f":"IF(H22=11,\"Ordinær +\",IF(T22=1,IF(H22>0,LOOKUP(H22,MENY!$N$2:O31,MENY!$O$2:$O$18),IF(C22>0,IF(B22=\"Lør\",\"-\",\"Ordinær\"),\"-\")),\"Søndag\"))","v":"-"},null,0,0,null,0,"",null,null,"",null,1,"00:00:00",0,"00:00:00","00:00:00","00:00:00","00:00:00","00:00:00","00:00:00",0,0,0,0,0,"07:30:00","00:00:00",0,1]
["2019-10-15",{"$f":"IF(WEEKDAY(A24,2)=1,WEEKNUM(A23)*-1-MENY!$I$12,IF(WEEKDAY(A23,2)<7,LOOKUP(WEEKDAY(A23,2),MENY!$P$8:$P$14,MENY!$Q$8:$Q$14),\"\"))","v":"Tirs"},null,null,null,null,"",0,{"$f":"IF(H23=11,\"Ordinær +\",IF(T23=1,IF(H23>0,LOOKUP(H23,MENY!$N$2:O32,MENY!$O$2:$O$18),IF(C23>0,IF(B23=\"Lør\",\"-\",\"Ordinær\"),\"-\")),\"Søndag\"))","v":"-"},null,0,0,null,0,"",null,null,"",null,1,"00:00:00",0,"00:00:00","00:00:00","00:00:00","00:00:00","00:00:00","00:00:00",0,0,0,0,0,"07:30:00","00:00:00",0,1]
["2019-10-16",{"$f":"IF(WEEKDAY(A25,2)=1,WEEKNUM(A24)*-1-MENY!$I$12,IF(WEEKDAY(A24,2)<7,LOOKUP(WEEKDAY(A24,2),MENY!$P$8:$P$14,MENY!$Q$8:$Q$14),\"\"))","v":"Ons"},null,null,null,null,"",0,{"$f":"IF(H24=11,\"Ordinær +\",IF(T24=1,IF(H24>0,LOOKUP(H24,MENY!$N$2:O33,MENY!$O$2:$O$18),IF(C24>0,IF(B24=\"Lør\",\"-\",\"Ordinær\"),\"-\")),\"Søndag\"))","v":"-"},null,0,0,null,0,"",null,null,"",null,1,"00:00:00",0,"00:00:00","00:00:00","00:00:00","00:00:00","00:00:00","00:00:00",0,0,0,0,0,"07:30:00","00:00:00",0,1]
["2019-10-17",{"$f":"IF(WEEKDAY(A26,2)=1,WEEKNUM(A25)*-1-MENY!$I$12,IF(WEEKDAY(A25,2)<7,LOOKUP(WEEKDAY(A25,2),MENY!$P$8:$P$14,MENY!$Q$8:$Q$14),\"\"))","v":"Tors"},null,null,null,null,"",0,{"$f":"IF(H25=11,\"Ordinær +\",IF(T25=1,IF(H25>0,LOOKUP(H25,MENY!$N$2:O34,MENY!$O$2:$O$18),IF(C25>0,IF(B25=\"Lør\",\"-\",\"Ordinær\"),\"-\")),\"Søndag\"))","v":"-"},null,0,0,null,0,"",null,null,"",null,1,"00:00:00",0,"00:00:00","00:00:00","00:00:00","00:00:00","00:00:00","00:00:00",0,0,0,0,0,"07:30:00","00:00:00",0,1]
["2019-10-18",{"$f":"IF(WEEKDAY(A27,2)=1,WEEKNUM(A26)*-1-MENY!$I$12,IF(WEEKDAY(A26,2)<7,LOOKUP(WEEKDAY(A26,2),MENY!$P$8:$P$14,MENY!$Q$8:$Q$14),\"\"))","v":"Fre"},null,null,null,null,"",0,{"$f":"IF(H26=11,\"Ordinær +\",IF(T26=1,IF(H26>0,LOOKUP(H26,MENY!$N$2:O35,MENY!$O$2:$O$18),IF(C26>0,IF(B26=\"Lør\",\"-\",\"Ordinær\"),\"-\")),\"Søndag\"))","v":"-"},null,0,0,null,0,"",null,null,"",null,1,"00:00:00",0,"00:00:00","00:00:00","00:00:00","00:00:00","00:00:00","00:00:00",0,0,0,0,0,"07:30:00","00:00:00",0,1]
["2019-10-19",{"$f":"IF(WEEKDAY(A28,2)=1,WEEKNUM(A27)*-1-MENY!$I$12,IF(WEEKDAY(A27,2)<7,LOOKUP(WEEKDAY(A27,2),MENY!$P$8:$P$14,MENY!$Q$8:$Q$14),\"\"))","v":"Lør"},null,null,null,null,"00:00:00",0,{"$f":"IF(H27=11,\"Ordinær +\",IF(T27=1,IF(H27>0,LOOKUP(H27,MENY!$N$2:O36,MENY!$O$2:$O$18),IF(C27>0,IF(B27=\"Lør\",\"-\",\"Ordinær\"),\"-\")),\"Søndag\"))","v":"-"},null,0,0,null,0,"",null,null,"",null,1,"","","00:00:00","","","","","",0,0,0,0,0,"07:30:00","00:00:00",0,1]
["2019-10-20",{"$f":"IF(WEEKDAY(A29,2)=1,WEEKNUM(A28)*-1-MENY!$I$12,IF(WEEKDAY(A28,2)<7,LOOKUP(WEEKDAY(A28,2),MENY!$P$8:$P$14,MENY!$Q$8:$Q$14),\"\"))","v":-43},null,null,null,null,"",0,{"$f":"IF(H28=11,\"Ordinær +\",IF(T28=1,IF(H28>0,LOOKUP(H28,MENY!$N$2:O37,MENY!$O$2:$O$18),IF(C28>0,IF(B28=\"Lør\",\"-\",\"Ordinær\"),\"-\")),\"Søndag\"))","v":"Søndag"},null,0,0,null,0,"",null,null,"",null,0,"00:00:00","","00:00:00","00:00:00","00:00:00","00:00:00","00:00:00","00:00:00",0,0,0,0,0,"07:30:00","00:00:00",0,1]
["2019-10-21",{"$f":"IF(WEEKDAY(A30,2)=1,WEEKNUM(A29)*-1-MENY!$I$12,IF(WEEKDAY(A29,2)<7,LOOKUP(WEEKDAY(A29,2),MENY!$P$8:$P$14,MENY!$Q$8:$Q$14),\"\"))","v":"Man"},null,null,null,null,"",0,{"$f":"IF(H29=11,\"Ordinær +\",IF(T29=1,IF(H29>0,LOOKUP(H29,MENY!$N$2:O38,MENY!$O$2:$O$18),IF(C29>0,IF(B29=\"Lør\",\"-\",\"Ordinær\"),\"-\")),\"Søndag\"))","v":"-"},null,0,0,null,0,"",null,null,"",null,1,"00:00:00",0,"00:00:00","00:00:00","00:00:00","00:00:00","00:00:00","00:00:00",0,0,0,0,0,"07:30:00","00:00:00",0,1]
["2019-10-22",{"$f":"IF(WEEKDAY(A31,2)=1,WEEKNUM(A30)*-1-MENY!$I$12,IF(WEEKDAY(A30,2)<7,LOOKUP(WEEKDAY(A30,2),MENY!$P$8:$P$14,MENY!$Q$8:$Q$14),\"\"))","v":"Tirs"},null,null,null,null,"",0,{"$f":"IF(H30=11,\"Ordinær +\",IF(T30=1,IF(H30>0,LOOKUP(H30,MENY!$N$2:O39,MENY!$O$2:$O$18),IF(C30>0,IF(B30=\"Lør\",\"-\",\"Ordinær\"),\"-\")),\"Søndag\"))","v":"-"},null,0,0,null,0,"",null,null,"",null,1,"00:00:00",0,"00:00:00","00:00:00","00:00:00","00:00:00","00:00:00","00:00:00",0,0,0,0,0,"07:30:00","00:00:00",0,1]
["2019-10-23",{"$f":"IF(WEEKDAY(A32,2)=1,WEEKNUM(A31)*-1-MENY!$I$12,IF(WEEKDAY(A31,2)<7,LOOKUP(WEEKDAY(A31,2),MENY!$P$8:$P$14,MENY!$Q$8:$Q$14),\"\"))","v":"Ons"},null,null,null,null,"",0,{"$f":"IF(H31=11,\"Ordinær +\",IF(T31=1,IF(H31>0,LOOKUP(H31,MENY!$N$2:O40,MENY!$O$2:$O$18),IF(C31>0,IF(B31=\"Lør\",\"-\",\"Ordinær\"),\"-\")),\"Søndag\"))","v":"-"},null,0,0,null,0,"",null,null,"",null,1,"00:00:00",0,"00:00:00","00:00:00","00:00:00","00:00:00","00:00:00","00:00:00",0,0,0,0,0,"07:30:00","00:00:00",0,1]
["2019-10-24",{"$f":"IF(WEEKDAY(A33,2)=1,WEEKNUM(A32)*-1-MENY!$I$12,IF(WEEKDAY(A32,2)<7,LOOKUP(WEEKDAY(A32,2),MENY!$P$8:$P$14,MENY!$Q$8:$Q$14),\"\"))","v":"Tors"},null,null,null,null,"",0,{"$f":"IF(H32=11,\"Ordinær +\",IF(T32=1,IF(H32>0,LOOKUP(H32,MENY!$N$2:O41,MENY!$O$2:$O$18),IF(C32>0,IF(B32=\"Lør\",\"-\",\"Ordinær\"),\"-\")),\"Søndag\"))","v":"-"},null,0,0,null,0,"",null,null,"",null,1,"00:00:00",0,"00:00:00","00:00:00","00:00:00","00:00:00","00:00:00","00:00:00",0,0,0,0,0,"07:30:00","00:00:00",0,1]
["2019-10-25",{"$f":"IF(WEEKDAY(A34,2)=1,WEEKNUM(A33)*-1-MENY!$I$12,IF(WEEKDAY(A33,2)<7,LOOKUP(WEEKDAY(A33,2),MENY!$P$8:$P$14,MENY!$Q$8:$Q$14),\"\"))","v":"Fre"},null,null,null,null,"",0,{"$f":"IF(H33=11,\"Ordinær +\",IF(T33=1,IF(H33>0,LOOKUP(H33,MENY!$N$2:O42,MENY!$O$2:$O$18),IF(C33>0,IF(B33=\"Lør\",\"-\",\"Ordinær\"),\"-\")),\"Søndag\"))","v":"-"},null,0,0,null,0,"",null,null,"",null,1,"00:00:00",0,"00:00:00","00:00:00","00:00:00","00:00:00","00:00:00","00:00:00",0,0,0,0,0,"07:30:00","00:00:00",0,1]
["2019-10-26",{"$f":"IF(WEEKDAY(A35,2)=1,WEEKNUM(A34)*-1-MENY!$I$12,IF(WEEKDAY(A34,2)<7,LOOKUP(WEEKDAY(A34,2),MENY!$P$8:$P$14,MENY!$Q$8:$Q$14),\"\"))","v":"Lør"},null,null,null,null,"00:00:00",0,{"$f":"IF(H34=11,\"Ordinær +\",IF(T34=1,IF(H34>0,LOOKUP(H34,MENY!$N$2:O43,MENY!$O$2:$O$18),IF(C34>0,IF(B34=\"Lør\",\"-\",\"Ordinær\"),\"-\")),\"Søndag\"))","v":"-"},null,0,0,null,0,"",null,null,"",null,1,"","","00:00:00","","","","","",0,0,0,0,0,"07:30:00","00:00:00",0,1]
["2019-10-27",{"$f":"IF(WEEKDAY(A36,2)=1,WEEKNUM(A35)*-1-MENY!$I$12,IF(WEEKDAY(A35,2)<7,LOOKUP(WEEKDAY(A35,2),MENY!$P$8:$P$14,MENY!$Q$8:$Q$14),\"\"))","v":-44},null,null,null,null,"",0,{"$f":"IF(H35=11,\"Ordinær +\",IF(T35=1,IF(H35>0,LOOKUP(H35,MENY!$N$2:O44,MENY!$O$2:$O$18),IF(C35>0,IF(B35=\"Lør\",\"-\",\"Ordinær\"),\"-\")),\"Søndag\"))","v":"Søndag"},null,0,0,null,0,"",null,null,"",null,{"$f":"IF(A35>0,IF(WEEKDAY(A35-1)<7,1,0),\"\")","v":0},"00:00:00","","00:00:00","00:00:00","00:00:00","00:00:00","00:00:00","00:00:00",0,0,0,0,0,"07:30:00","00:00:00",0,1]
["2019-10-28",{"$f":"IF(WEEKDAY(A37,2)=1,WEEKNUM(A36)*-1-MENY!$I$12,IF(WEEKDAY(A36,2)<7,LOOKUP(WEEKDAY(A36,2),MENY!$P$8:$P$14,MENY!$Q$8:$Q$14),\"\"))","v":"Man"},null,null,null,null,"",0,{"$f":"IF(H36=11,\"Ordinær +\",IF(T36=1,IF(H36>0,LOOKUP(H36,MENY!$N$2:O45,MENY!$O$2:$O$18),IF(C36>0,IF(B36=\"Lør\",\"-\",\"Ordinær\"),\"-\")),\"Søndag\"))","v":"-"},null,0,0,null,0,"",null,null,"",null,{"$f":"IF(A36>0,IF(WEEKDAY(A36-1)<7,1,0),\"\")","v":1},"00:00:00",0,"00:00:00","00:00:00","00:00:00","00:00:00","00:00:00","00:00:00",0,0,0,0,0,"07:30:00","00:00:00",0,1]
["2019-10-29",{"$f":"IF(WEEKDAY(A38,2)=1,WEEKNUM(A37)*-1-MENY!$I$12,IF(WEEKDAY(A37,2)<7,LOOKUP(WEEKDAY(A37,2),MENY!$P$8:$P$14,MENY!$Q$8:$Q$14),\"\"))","v":"Tirs"},null,null,null,null,"",0,{"$f":"IF(H37=11,\"Ordinær +\",IF(T37=1,IF(H37>0,LOOKUP(H37,MENY!$N$2:O46,MENY!$O$2:$O$18),IF(C37>0,IF(B37=\"Lør\",\"-\",\"Ordinær\"),\"-\")),\"Søndag\"))","v":"-"},null,0,0,null,0,"",null,null,"",null,{"$f":"IF(A37>0,IF(WEEKDAY(A37-1)<7,1,0),\"\")","v":1},"00:00:00",0,"00:00:00","00:00:00","00:00:00","00:00:00","00:00:00","00:00:00",0,0,0,0,0,"07:30:00","00:00:00",0,1]
["2019-10-30",{"$f":"IF(WEEKDAY(A39,2)=1,WEEKNUM(A38)*-1-MENY!$I$12,IF(WEEKDAY(A38,2)<7,LOOKUP(WEEKDAY(A38,2),MENY!$P$8:$P$14,MENY!$Q$8:$Q$14),\"\"))","v":"Ons"},null,null,null,null,"",0,{"$f":"IF(H38=11,\"Ordinær +\",IF(T38=1,IF(H38>0,LOOKUP(H38,MENY!$N$2:O47,MENY!$O$2:$O$18),IF(C38>0,IF(B38=\"Lør\",\"-\",\"Ordinær\"),\"-\")),\"Søndag\"))","v":"-"},null,0,0,null,0,"",null,null,"",null,{"$f":"IF(A38>0,IF(WEEKDAY(A38-1)<7,1,0),\"\")","v":1},"00:00:00",0,"00:00:00","00:00:00","00:00:00","00:00:00","00:00:00","00:00:00",0,0,0,0,0,"07:30:00","00:00:00",0,1]
["2019-10-31",{"$f":"IF(WEEKDAY(A40,2)=1,WEEKNUM(A39)*-1-MENY!$I$12,IF(WEEKDAY(A39,2)<7,LOOKUP(WEEKDAY(A39,2),MENY!$P$8:$P$14,MENY!$Q$8:$Q$14),\"\"))","v":"Tors"},null,null,null,null,"",0,{"$f":"IF(A39>0,IF(H39=11,\"Ordinær +\",IF(T39=1,IF(H39>0,LOOKUP(H39,MENY!$N$2:O48,MENY!$O$2:$O$18),IF(C39>0,IF(B39=\"Lør\",\"-\",\"Ordinær\"),\"-\")),\"Søndag\")),\"-\")","v":"-"},null,0,0,null,0,"",null,null,"",null,{"$f":"IF(A39>0,IF(WEEKDAY(A39-1)<7,1,0),\"\")","v":1},"00:00:00",0,"00:00:00","00:00:00","00:00:00","00:00:00",{"$f":"IF(B39=\"Lør\",\"\",IF(T39=1,IF(H39=9,AH39,0),0))","v":"00:00:00"},"00:00:00",0,0,0,0,0,"07:30:00","00:00:00",0,1]
[null,null,null,"Sum for denne måned",null,null,{"$f":"SUM(G9:G39)*24","v":0},null,null,null,{"$f":"SUM(K9:K39)+N49","v":0},{"$f":"SUM(L9:L39)","v":0},{"$f":"SUM(M9:M39)","v":0},{"$f":"SUM(N9:N39)-U40-AG41-SUM(K40:M40)+N50","v":0},{"$f":"SUM(O9:O39)","v":0},"Fravær denne måned",null,null,null,null,{"$f":"SUM(U9:U39)*24","v":0},{"$f":"SUM(V9:V39)","v":0},{"$f":"SUM(W9:W39)*24","v":0},0,0,0,0,0,{"$f":"SUM(AC9:AC39)","v":0},{"$f":"SUM(AD9:AD39)","v":0},{"$f":"SUM(AE9:AE39)","v":0},{"$f":"SUM(AF9:AF39)","v":0},{"$f":"SUM(AG9:AG39)","v":0}]
[null,null,null,"Overført fra forrige måned",null,null,null,null,null,null,null,null,null,{"$f":"SEP!N47","v":0},{"$f":"SEP!O42","v":0},"Type","Timer",null,null,null,null,null,null,null,null,null,null,null,null,null,null,"Sum deltidsfravær:",{"$f":"SUM(AC40:AG40)","v":0}]
[null,null,null,"Sum hittil i år",null,null,null,null,null,null,null,null,null,{"$f":"SUM(N40:N41)","v":0},{"$f":"SUM(O40:O41)","v":0},"06 Perm m/lønn",{"$f":"X40+AC40*-1","v":0}]
["Ferieregnskap",null,null,"Dager","Timeregnskap",null,null,null,null,null,null,null,null,"Timer",null,"07 Perm u/lønn",{"$f":"Y40+AD40*-1","v":0}]
["Disponible feriedager",null,null,{"$f":"SEP!D47","v":25},"Opptjent denne måneden",null,null,null,null,null,null,null,null,{"$f":"SUM(N9:N39)-AG41-(SUM(K40:M40))+N50","v":0},null,"08 Sykemelding",{"$f":"(Z40+AE40*-1)","v":0}]
["Brukt denne måned",null,null,{"$f":"V40*-1","v":0},"Avspasert denne måneden",null,null,null,null,null,null,null,null,{"$f":"U40","v":0},null,"09 Egenmelding",{"$f":"(AA40+AF40*-1)","v":0}]
["Endring i feriedager",null,null,null,"Utbetalt overtid denne måned",null,null,null,null,null,null,null,null,{"$f":"SUM(K40:M40)","v":0},null,"10 Sykt barn",{"$f":"(AB40+AG40*-1)","v":0}]
["Til gode",null,null,{"$f":"SUM(D44:D46)","v":25},"Til gode for avspasering",null,null,null,null,null,null,null,null,{"$f":"N42","v":0},null,"Sum - Oktober",{"$f":"SUM(Q42:Q46)","v":0}]
[null,null,null,null,"Effektiv arbeidstid denne måned",null,null,null,null,null,null,null,null,{"$f":"G40+N44+AG41+N46-N50","v":0},null,"Hittil i år",{"$f":"Q47+SEP!Q48","v":0}]
[null,null,null,null,"Flexitid omgjort til overtid og utbetalt, denne måned"]
[null,null,null,null,"Annen korrigering av flexitid, OBS! skriv egen merknad"]
["Merknader"]
[]
[]
[]
[]
[]
["Overtid for utbetaling:",null,null,null,null,null,"Dato",null,null,null,null,null,null,null,"Dato"]
[null,null,null,"Timer med 50% tillegg :",{"$f":"K40","v":0}]
[null,null,null,"Timer med 100% tillegg:",{"$f":"L40","v":0}]
[null,null,null,"Timer med 133% tillegg:",{"$f":"M39","v":0},null,null,null,"Attestert",null,null,null,null,null,"Anvist"]
[]
[]
[null,null,null,null,null,null,null,null,null,null,null,null,null,null,null,{"$f":"MENY!D6","v":"Leder"}]
["© Ole Jørgen Klaussen - 2003",null,null,null,{"$f":"TODAY()","v":"2018-11-30"},{"$f":"YEAR(TODAY())","v":2018},null,null,null,null,null,null,null,null,null,null,"ole.klaussen@online.no"]

{"sheet":"NOV","index":11,"n_rows":64,"n_cols":37,"rows_kept":64,"cut":false,"hidden":false,"merged":[[23,15,23,16],[24,15,24,16],[28,15,28,16],[29,15,29,16],[18,15,18,16],[20,15,20,16],[16,15,16,16],[2,1,2,6],[2,15,2,16],[22,15,22,16],[9,15,9,16],[10,15,10,16],[11,15,11,16],[6,3,6,4],[7,7,7,8],[5,7,6,16],[21,15,21,16],[8,15,8,16],[19,15,19,16],[13,15,13,16],[14,15,14,16],[1,28,2,33],[59,14,59,16],[62,6,62,10],[55,0,55,16],[56,6,56,10],[56,14,56,16],[51,0,51,16],[5,19,5,22],[7,15,7,16],[17,15,17,16],[15,15,15,16],[12,15,12,16],[38,15,38,16],[31,15,31,16],[32,15,32,16],[33,15,33,16],[52,0,52,16],[53,0,53,16],[54,0,54,16],[25,15,25,16],[26,15,26,16],[27,15,27,16],[36,15,36,16],[37,15,37,16],[35,15,35,16],[34,15,34,16],[30,15,30,16]]}
["Meny","JAN","FEB","MAR","APR","MAI","JUN",null,null,null,null,null,null,null,null,null,"Hjelp","Viktig når det gjelder overtid"]
["Året","JUL","AUG","SEP","OKT","NOV","DES",null,null,null,null,null,null,null,null,"Dato",null,"For at føringer av aktiv arbeidstid skal bli riktig"]
[null,{"$f":"MENY!D4","v":"Min bedrift"},null,null,null,null,null,null,"November -",null,null,null,null,{"$f":"MENY!P1","v":2019},null,{"$f":"TODAY()","v":"2018-11-30"},null,"er det nødvendig at all arbeidstid registreres."]
[null,"Timeliste","Navn:",{"$f":"MENY!D5","v":"Min timeliste"},null,null,"Sommer",null,null,null,"Stillingsbrøk:",{"$f":"MENY!I5","v":1},null,"Vinter",null,null,null,"Dette gjelder også overtid. Så registrer  når du ",null,null,null,null,null,null,null,null,null,null,null,null,null,null,null,null,null,"MERK!"]
[null,null,"Sommerlukking fra/til:",null,{"$f":"MENY!Q18","v":"2019-05-15"},{"$f":"MENY!Q19","v":"2019-09-14"},{"$f":"(MENY!F13-MENY!E13-MENY!I13)*MENY!I5","v":"07:30:00"},null,{"$f":"MENY!I13","v":"00:00:00"},"  <-arbeidstid->",null,null,{"$f":"MENY!I14","v":"00:00:00"},{"$f":"(MENY!F14-MENY!E14-MENY!I14)*MENY!I5","v":"07:30:00"},null,null,null,"kommer på jobb (inn) og når du er ferdig (ut)",null,null,null,null,null,null,null,null,null,null,null,null,null,null,null,null,null,"Les her"]
["År ",null,null,null,null,null,null,"Fyll ut i arbeids og fraværskode : 0=ordinær  1=Avspasere  2=Ferie  3=Tjeneste  4=Plussdag  5=Helligdag  6=Perm M/lønn  7=Perm U/lønn  8=Sykemelding  9=Egenmelding 10=Sykt barn 11=Ordinær+ , 12 = plusstid som overtid",null,null,null,null,null,null,null,null,null,"Dersom noe av tiden skal utbetales i overtid, så",null,"Arbeidsdata",null,null,null,null,null,null,null,null,6,7,8,9,10,null,null,"Syke-","Stillings"]
[{"$f":"N3","v":2019},{"$f":"WEEKNUM(A9)+MENY!I12","v":44},"I dag","Fravær pr dag",null,"I dag",null,null,null,null,null,null,null,null,null,null,null,"legg inn antall timer nederst på arket.",null,null,null,null,null,6,7,8,9,10,12,13,14,15,16,null,null,"melding","brøk"]
["DATO","UKENR                               og DAG","Inn","Ut","Inn","Ut","Ordinær","Arbeids og fraværskode",null,"Fravær",0.5,1,1.33,"Balanse","Timer i dag","Merknad ",null,"Huskeliste",null,"Arbeids dag","Avsp","Ferie","Tjeneste","Perm m-lønn","Perm u-lønn","Sykemelding","Egenmelding","Sykt barn","Perm m-lønn","Perm u-lønn","Sykemelding","Egenmelding","Sykt barn","Ordinær arbeidstid","Trekk for matpause","i prosent andel"]
[{"$f":"DATE(MENY!P1,11,1)","v":"2019-11-01"},{"$f":"IF(WEEKDAY(A10,2)=1,WEEKNUM(A9)*-1-MENY!$I$12,IF(WEEKDAY(A9,2)<7,LOOKUP(WEEKDAY(A9,2),MENY!$P$8:$P$14,MENY!$Q$8:$Q$14),\"\"))","v":"Fre"},null,null,null,null,{"$f":"IF(H9=11,F9-C9-(E9-D9),IF(B9=\"Lør\",0,IF(H9=4,0,IF(H9=3,IF(T9>0,W9,\"\"),IF(H9=1,0, IF(C9>0,  AH9,       \"\"))))))","v":""},{"$f":"IF(B9=\"Lør\",IF(C9>0,4,0),0)","v":0},{"$f":"IF(H9=11,\"Ordinær +\",IF(T9=1,IF(H9>0,LOOKUP(H9,MENY!$N$2:O18,MENY!$O$2:$O$18),IF(C9>0,IF(B9=\"Lør\",\"-\",\"Ordinær\"),\"-\")),\"Søndag\"))","v":"-"},null,{"$f":"IF(H9=12,IF(N9>=4,4,N9),0)","v":0},{"$f":"IF(H9=12,IF(N9>K9,N9-4,0),0)","v":0},null,{"$f":"IF(H9=11,0,IF(T9=1,IF(H9=4,((F9-C9)-(E9-D9))*24,IF(C9>0,(F9-C9-(E9-D9)-G9-AI9)*24,0)),0))","v":0},{"$f":"IF(F9>0,G9*24+N9,\"\")","v":""},null,null,{"$f":"IF(O9=\"\",\"\",\"Husk, fordel timer til prosjekter\")","v":""},null,{"$f":"IF(WEEKDAY(A9-1)<7,1,0)","v":1},{"$f":"IF(B9=\"Lør\",\"\",IF(T9=1,IF(H9=1,AH9,0),0))","v":"00:00:00"},{"$f":"IF(T9=1,IF(B9=\"lør\",\"\",IF(H9=2,1,0)),\"\")","v":0},{"$f":"IF(T9=1,IF(H9=3,AH9,0),0)","v":"00:00:00"},{"$f":"IF(B9=\"lør\",\"\",IF(T9=1,IF(H9=6,AH9,0),0))","v":"00:00:00"},{"$f":"IF(B9=\"Lør\",\"\",IF(T9=1,IF(H9=7,AH9,0),0))","v":"00:00:00"},{"$f":"IF(AJ9>0,IF(C9>0,    (AH9*AJ9)/(1-AJ9),0),           IF(B9=\"Lør\",\"\",IF(T9=1,IF(H9=8,AH9,0),0)))","v":"00:00:00"},{"$f":"IF(B9=\"Lør\",\"\",IF(T9=1,IF(H9=9,AH9,0),0))","v":"00:00:00"},{"$f":"IF(B9=\"Lør\",\"\",IF(T9=1,IF(H9=10,AH9,0),0))","v":"00:00:00"},{"$f":"IF(J9=6,N9,0)","v":0},{"$f":"IF(J9=7,N9,0)","v":0},{"$f":"IF(J9=8,N9,0)","v":0},{"$f":"IF(J9=9,N9,0)","v":0},{"$f":"IF(J9=10,N9,0)","v":0},{"$f":"((IF(A9<$F$5+1,IF(A9>$E$5-1,$G$5,$N$5),$N$5))*(1-AJ9))*(AK9)","v":"07:30:00"},{"$f":"IF(A9<$F$5+1,IF(A9>$E$5-1,$I$5,$M$5),$M$5)","v":"00:00:00"},{"$f":"OKT!AJ39","v":0},{"$f":"OKT!AK39","v":1}]
[{"$f":"A9+1","v":"2019-11-02"},{"$f":"IF(WEEKDAY(A11,2)=1,WEEKNUM(A10)*-1-MENY!$I$12,IF(WEEKDAY(A10,2)<7,LOOKUP(WEEKDAY(A10,2),MENY!$P$8:$P$14,MENY!$Q$8:$Q$14),\"\"))","v":"Lør"},null,null,null,null,{"$f":"IF(H10=11,F10-C10-(E10-D10),IF(B10=\"Lør\",0,IF(H10=4,0,IF(H10=3,IF(T10>0,W10,\"\"),IF(H10=1,0, IF(C10>0,  AH10,       \"\"))))))","v":"00:00:00"},0,{"$f":"IF(H10=11,\"Ordinær +\",IF(T10=1,IF(H10>0,LOOKUP(H10,MENY!$N$2:O19,MENY!$O$2:$O$18),IF(C10>0,IF(B10=\"Lør\",\"-\",\"Ordinær\"),\"-\")),\"Søndag\"))","v":"-"},null,{"$f":"IF(H10=12,IF(N10>=4,4,N10),0)","v":0},{"$f":"IF(H10=12,IF(N10>K10,N10-4,0),0)","v":0},null,{"$f":"IF(H10=11,0,IF(T10=1,IF(H10=4,((F10-C10)-(E10-D10))*24,IF(C10>0,(F10-C10-(E10-D10)-G10-AI10)*24,0)),0))","v":0},{"$f":"IF(F10>0,G10*24+N10,\"\")","v":""},null,null,{"$f":"IF(O10=\"\",\"\",\"Husk, fordel timer til prosjekter\")","v":""},null,{"$f":"IF(WEEKDAY(A10-1)<7,1,0)","v":1},{"$f":"IF(B10=\"Lør\",\"\",IF(T10=1,IF(H10=1,AH10,0),0))","v":""},"",{"$f":"IF(T10=1,IF(H10=3,AH10,0),0)","v":"00:00:00"},{"$f":"IF(B10=\"lør\",\"\",IF(T10=1,IF(H10=6,AH10,0),0))","v":""},{"$f":"IF(B10=\"Lør\",\"\",IF(T10=1,IF(H10=7,AH10,0),0))","v":""},{"$f":"IF(AJ10>0,IF(C10>0,    (AH10*AJ10)/(1-AJ10),0),           IF(B10=\"Lør\",\"\",IF(T10=1,IF(H10=8,AH10,0),0)))","v":""},{"$f":"IF(B10=\"Lør\",\"\",IF(T10=1,IF(H10=9,AH10,0),0))","v":""},{"$f":"IF(B10=\"Lør\",\"\",IF(T10=1,IF(H10=10,AH10,0),0))","v":""},0,0,0,0,0,{"$f":"((IF(A10<$F$5+1,IF(A10>$E$5-1,$G$5,$N$5),$N$5))*(1-AJ10))*(AK10)","v":"07:30:00"},{"$f":"IF(A10<$F$5+1,IF(A10>$E$5-1,$I$5,$M$5),$M$5)","v":"00:00:00"},{"$f":"AJ9","v":0},{"$f":"AK9","v":1}]
[{"$f":"A10+1","v":"2019-11-03"},{"$f":"IF(WEEKDAY(A12,2)=1,WEEKNUM(A11)*-1-MENY!$I$12,IF(WEEKDAY(A11,2)<7,LOOKUP(WEEKDAY(A11,2),MENY!$P$8:$P$14,MENY!$Q$8:$Q$14),\"\"))","v":-45},null,null,null,null,{"$f":"IF(H11=11,F11-C11-(E11-D11),IF(B11=\"Lør\",0,IF(H11=4,0,IF(H11=3,IF(T11>0,W11,\"\"),IF(H11=1,0, IF(C11>0,  AH11,       \"\"))))))","v":""},0,{"$f":"IF(H11=11,\"Ordinær +\",IF(T11=1,IF(H11>0,LOOKUP(H11,MENY!$N$2:O20,MENY!$O$2:$O$18),IF(C11>0,IF(B11=\"Lør\",\"-\",\"Ordinær\"),\"-\")),\"Søndag\"))","v":"Søndag"},null,0,0,null,0,"",null,null,"",null,0,"00:00:00","","00:00:00","00:00:00","00:00:00","00:00:00","00:00:00","00:00:00",0,0,0,0,0,"07:30:00","00:00:00",{"$f":"AJ10","v":0},{"$f":"AK10","v":1}]
["2019-11-04",{"$f":"IF(WEEKDAY(A13,2)=1,WEEKNUM(A12)*-1-MENY!$I$12,IF(WEEKDAY(A12,2)<7,LOOKUP(WEEKDAY(A12,2),MENY!$P$8:$P$14,MENY!$Q$8:$Q$14),\"\"))","v":"Man"},null,null,null,null,"",0,{"$f":"IF(H12=11,\"Ordinær +\",IF(T12=1,IF(H12>0,LOOKUP(H12,MENY!$N$2:O21,MENY!$O$2:$O$18),IF(C12>0,IF(B12=\"Lør\",\"-\",\"Ordinær\"),\"-\")),\"Søndag\"))","v":"-"},null,0,0,null,0,"",null,null,"",null,1,"00:00:00",0,"00:00:00","00:00:00","00:00:00","00:00:00","00:00:00","00:00:00",0,0,0,0,0,"07:30:00","00:00:00",0,1]
["2019-11-05",{"$f":"IF(WEEKDAY(A14,2)=1,WEEKNUM(A13)*-1-MENY!$I$12,IF(WEEKDAY(A13,2)<7,LOOKUP(WEEKDAY(A13,2),MENY!$P$8:$P$14,MENY!$Q$8:$Q$14),\"\"))","v":"Tirs"},null,null,null,null,"",0,{"$f":"IF(H13=11,\"Ordinær +\",IF(T13=1,IF(H13>0,LOOKUP(H13,MENY!$N$2:O22,MENY!$O$2:$O$18),IF(C13>0,IF(B13=\"Lør\",\"-\",\"Ordinær\"),\"-\")),\"Søndag\"))","v":"-"},null,0,0,null,0,"",null,null,"",null,1,"00:00:00",0,"00:00:00","00:00:00","00:00:00","00:00:00","00:00:00","00:00:00",0,0,0,0,0,"07:30:00","00:00:00",0,1]
["2019-11-06",{"$f":"IF(WEEKDAY(A15,2)=1,WEEKNUM(A14)*-1-MENY!$I$12,IF(WEEKDAY(A14,2)<7,LOOKUP(WEEKDAY(A14,2),MENY!$P$8:$P$14,MENY!$Q$8:$Q$14),\"\"))","v":"Ons"},null,null,null,null,"",0,{"$f":"IF(H14=11,\"Ordinær +\",IF(T14=1,IF(H14>0,LOOKUP(H14,MENY!$N$2:O23,MENY!$O$2:$O$18),IF(C14>0,IF(B14=\"Lør\",\"-\",\"Ordinær\"),\"-\")),\"Søndag\"))","v":"-"},null,0,0,null,0,"",null,null,"",null,1,"00:00:00",0,"00:00:00","00:00:00","00:00:00","00:00:00","00:00:00","00:00:00",0,0,0,0,0,"07:30:00","00:00:00",0,1]
["2019-11-07",{"$f":"IF(WEEKDAY(A16,2)=1,WEEKNUM(A15)*-1-MENY!$I$12,IF(WEEKDAY(A15,2)<7,LOOKUP(WEEKDAY(A15,2),MENY!$P$8:$P$14,MENY!$Q$8:$Q$14),\"\"))","v":"Tors"},null,null,null,null,"",0,{"$f":"IF(H15=11,\"Ordinær +\",IF(T15=1,IF(H15>0,LOOKUP(H15,MENY!$N$2:O24,MENY!$O$2:$O$18),IF(C15>0,IF(B15=\"Lør\",\"-\",\"Ordinær\"),\"-\")),\"Søndag\"))","v":"-"},null,0,0,null,0,"",null,null,"",null,1,"00:00:00",0,"00:00:00","00:00:00","00:00:00","00:00:00","00:00:00","00:00:00",0,0,0,0,0,"07:30:00","00:00:00",0,1]
["2019-11-08",{"$f":"IF(WEEKDAY(A17,2)=1,WEEKNUM(A16)*-1-MENY!$I$12,IF(WEEKDAY(A16,2)<7,LOOKUP(WEEKDAY(A16,2),MENY!$P$8:$P$14,MENY!$Q$8:$Q$14),\"\"))","v":"Fre"},null,null,null,null,"",0,{"$f":"IF(H16=11,\"Ordinær +\",IF(T16=1,IF(H16>0,LOOKUP(H16,MENY!$N$2:O25,MENY!$O$2:$O$18),IF(C16>0,IF(B16=\"Lør\",\"-\",\"Ordinær\"),\"-\")),\"Søndag\"))","v":"-"},null,0,0,null,0,"",null,null,"",null,1,"00:00:00",0,"00:00:00","00:00:00","00:00:00","00:00:00","00:00:00","00:00:00",0,0,0,0,0,"07:30:00","00:00:00",0,1]
["2019-11-09",{"$f":"IF(WEEKDAY(A18,2)=1,WEEKNUM(A17)*-1-MENY!$I$12,IF(WEEKDAY(A17,2)<7,LOOKUP(WEEKDAY(A17,2),MENY!$P$8:$P$14,MENY!$Q$8:$Q$14),\"\"))","v":"Lør"},null,null,null,null,"00:00:00",0,{"$f":"IF(H17=11,\"Ordinær +\",IF(T17=1,IF(H17>0,LOOKUP(H17,MENY!$N$2:O26,MENY!$O$2:$O$18),IF(C17>0,IF(B17=\"Lør\",\"-\",\"Ordinær\"),\"-\")),\"Søndag\"))","v":"-"},null,0,0,null,0,"",null,null,"",null,1,"","","00:00:00","","","","","",0,0,0,0,0,"07:30:00","00:00:00",0,1]
["2019-11-10",{"$f":"IF(WEEKDAY(A19,2)=1,WEEKNUM(A18)*-1-MENY!$I$12,IF(WEEKDAY(A18,2)<7,LOOKUP(WEEKDAY(A18,2),MENY!$P$8:$P$14,MENY!$Q$8:$Q$14),\"\"))","v":-46},null,null,null,null,"",0,{"$f":"IF(H18=11,\"Ordinær +\",IF(T18=1,IF(H18>0,LOOKUP(H18,MENY!$N$2:O27,MENY!$O$2:$O$18),IF(C18>0,IF(B18=\"Lør\",\"-\",\"Ordinær\"),\"-\")),\"Søndag\"))","v":"Søndag"},null,0,0,null,0,"",null,null,"",null,0,"00:00:00","","00:00:00","00:00:00","00:00:00","00:00:00","00:00:00","00:00:00",0,0,0,0,0,"07:30:00","00:00:00",0,1]
["2019-11-11",{"$f":"IF(WEEKDAY(A20,2)=1,WEEKNUM(A19)*-1-MENY!$I$12,IF(WEEKDAY(A19,2)<7,LOOKUP(WEEKDAY(A19,2),MENY!$P$8:$P$14,MENY!$Q$8:$Q$14),\"\"))","v":"Man"},null,null,null,null,"",0,{"$f":"IF(H19=11,\"Ordinær +\",IF(T19=1,IF(H19>0,LOOKUP(H19,MENY!$N$2:O28,MENY!$O$2:$O$18),IF(C19>0,IF(B19=\"Lør\",\"-\",\"Ordinær\"),\"-\")),\"Søndag\"))","v":"-"},null,0,0,null,0,"",null,null,"",null,1,"00:00:00",0,"00:00:00","00:00:00","00:00:00","00:00:00","00:00:00","00:00:00",0,0,0,0,0,"07:30:00","00:00:00",0,1]
["2019-11-12",{"$f":"IF(WEEKDAY(A21,2)=1,WEEKNUM(A20)*-1-MENY!$I$12,IF(WEEKDAY(A20,2)<7,LOOKUP(WEEKDAY(A20,2),MENY!$P$8:$P$14,MENY!$Q$8:$Q$14),\"\"))","v":"Tirs"},null,null,null,null,"",0,{"$f":"IF(H20=11,\"Ordinær +\",IF(T20=1,IF(H20>0,LOOKUP(H20,MENY!$N$2:O29,MENY!$O$2:$O$18),IF(C20>0,IF(B20=\"Lør\",\"-\",\"Ordinær\"),\"-\")),\"Søndag\"))","v":"-"},null,0,0,null,0,"",null,null,"",null,1,"00:00:00",0,"00:00:00","00:00:00","00:00:00","00:00:00","00:00:00","00:00:00",0,0,0,0,0,"07:30:00","00:00:00",0,1]
["2019-11-13",{"$f":"IF(WEEKDAY(A22,2)=1,WEEKNUM(A21)*-1-MENY!$I$12,IF(WEEKDAY(A21,2)<7,LOOKUP(WEEKDAY(A21,2),MENY!$P$8:$P$14,MENY!$Q$8:$Q$14),\"\"))","v":"Ons"},null,null,null,null,"",0,{"$f":"IF(H21=11,\"Ordinær +\",IF(T21=1,IF(H21>0,LOOKUP(H21,MENY!$N$2:O30,MENY!$O$2:$O$18),IF(C21>0,IF(B21=\"Lør\",\"-\",\"Ordinær\"),\"-\")),\"Søndag\"))","v":"-"},null,0,0,null,0,"",null,null,"",null,1,"00:00:00",0,"00:00:00","00:00:00","00:00:00","00:00:00","00:00:00","00:00:00",0,0,0,0,0,"07:30:00","00:00:00",0,1]
["2019-11-14",{"$f":"IF(WEEKDAY(A23,2)=1,WEEKNUM(A22)*-1-MENY!$I$12,IF(WEEKDAY(A22,2)<7,LOOKUP(WEEKDAY(A22,2),MENY!$P$8:$P$14,MENY!$Q$8:$Q$14),\"\"))","v":"Tors"},null,null,null,null,"",0,{"$f":"IF(H22=11,\"Ordinær +\",IF(T22=1,IF(H22>0,LOOKUP(H22,MENY!$N$2:O31,MENY!$O$2:$O$18),IF(C22>0,IF(B22=\"Lør\",\"-\",\"Ordinær\"),\"-\")),\"Søndag\"))","v":"-"},null,0,0,null,0,"",null,null,"",null,1,"00:00:00",0,"00:00:00","00:00:00","00:00:00","00:00:00","00:00:00","00:00:00",0,0,0,0,0,"07:30:00","00:00:00",0,1]
["2019-11-15",{"$f":"IF(WEEKDAY(A24,2)=1,WEEKNUM(A23)*-1-MENY!$I$12,IF(WEEKDAY(A23,2)<7,LOOKUP(WEEKDAY(A23,2),MENY!$P$8:$P$14,MENY!$Q$8:$Q$14),\"\"))","v":"Fre"},null,null,null,null,"",0,{"$f":"IF(H23=11,\"Ordinær +\",IF(T23=1,IF(H23>0,LOOKUP(H23,MENY!$N$2:O32,MENY!$O$2:$O$18),IF(C23>0,IF(B23=\"Lør\",\"-\",\"Ordinær\"),\"-\")),\"Søndag\"))","v":"-"},null,0,0,null,0,"",null,null,"",null,1,"00:00:00",0,"00:00:00","00:00:00","00:00:00","00:00:00","00:00:00","00:00:00",0,0,0,0,0,"07:30:00","00:00:00",0,1]
["2019-11-16",{"$f":"IF(WEEKDAY(A25,2)=1,WEEKNUM(A24)*-1-MENY!$I$12,IF(WEEKDAY(A24,2)<7,LOOKUP(WEEKDAY(A24,2),MENY!$P$8:$P$14,MENY!$Q$8:$Q$14),\"\"))","v":"Lør"},null,null,null,null,"00:00:00",0,{"$f":"IF(H24=11,\"Ordinær +\",IF(T24=1,IF(H24>0,LOOKUP(H24,MENY!$N$2:O33,MENY!$O$2:$O$18),IF(C24>0,IF(B24=\"Lør\",\"-\",\"Ordinær\"),\"-\")),\"Søndag\"))","v":"-"},null,0,0,null,0,"",null,null,"",null,1,"","","00:00:00","","","","","",0,0,0,0,0,"07:30:00","00:00:00",0,1]
["2019-11-17",{"$f":"IF(WEEKDAY(A26,2)=1,WEEKNUM(A25)*-1-MENY!$I$12,IF(WEEKDAY(A25,2)<7,LOOKUP(WEEKDAY(A25,2),MENY!$P$8:$P$14,MENY!$Q$8:$Q$14),\"\"))","v":-47},null,null,null,null,"",0,{"$f":"IF(H25=11,\"Ordinær +\",IF(T25=1,IF(H25>0,LOOKUP(H25,MENY!$N$2:O34,MENY!$O$2:$O$18),IF(C25>0,IF(B25=\"Lør\",\"-\",\"Ordinær\"),\"-\")),\"Søndag\"))","v":"Søndag"},null,0,0,null,0,"",null,null,"",null,0,"00:00:00","","00:00:00","00:00:00","00:00:00","00:00:00","00:00:00","00:00:00",0,0,0,0,0,"07:30:00","00:00:00",0,1]
["2019-11-18",{"$f":"IF(WEEKDAY(A27,2)=1,WEEKNUM(A26)*-1-MENY!$I$12,IF(WEEKDAY(A26,2)<7,LOOKUP(WEEKDAY(A26,2),MENY!$P$8:$P$14,MENY!$Q$8:$Q$14),\"\"))","v":"Man"},null,null,null,null,"",0,{"$f":"IF(H26=11,\"Ordinær +\",IF(T26=1,IF(H26>0,LOOKUP(H26,MENY!$N$2:O35,MENY!$O$2:$O$18),IF(C26>0,IF(B26=\"Lør\",\"-\",\"Ordinær\"),\"-\")),\"Søndag\"))","v":"-"},null,0,0,null,0,"",null,null,"",null,1,"00:00:00",0,"00:00:00","00:00:00","00:00:00","00:00:00","00:00:00","00:00:00",0,0,0,0,0,"07:30:00","00:00:00",0,1]
["2019-11-19",{"$f":"IF(WEEKDAY(A28,2)=1,WEEKNUM(A27)*-1-MENY!$I$12,IF(WEEKDAY(A27,2)<7,LOOKUP(WEEKDAY(A27,2),MENY!$P$8:$P$14,MENY!$Q$8:$Q$14),\"\"))","v":"Tirs"},null,null,null,null,"",0,{"$f":"IF(H27=11,\"Ordinær +\",IF(T27=1,IF(H27>0,LOOKUP(H27,MENY!$N$2:O36,MENY!$O$2:$O$18),IF(C27>0,IF(B27=\"Lør\",\"-\",\"Ordinær\"),\"-\")),\"Søndag\"))","v":"-"},null,0,0,null,0,"",null,null,"",null,1,"00:00:00",0,"00:00:00","00:00:00","00:00:00","00:00:00","00:00:00","00:00:00",0,0,0,0,0,"07:30:00","00:00:00",0,1]
["2019-11-20",{"$f":"IF(WEEKDAY(A29,2)=1,WEEKNUM(A28)*-1-MENY!$I$12,IF(WEEKDAY(A28,2)<7,LOOKUP(WEEKDAY(A28,2),MENY!$P$8:$P$14,MENY!$Q$8:$Q$14),\"\"))","v":"Ons"},null,null,null,null,"",0,{"$f":"IF(H28=11,\"Ordinær +\",IF(T28=1,IF(H28>0,LOOKUP(H28,MENY!$N$2:O37,MENY!$O$2:$O$18),IF(C28>0,IF(B28=\"Lør\",\"-\",\"Ordinær\"),\"-\")),\"Søndag\"))","v":"-"},null,0,0,null,0,"",null,null,"",null,1,"00:00:00",0,"00:00:00","00:00:00","00:00:00","00:00:00","00:00:00","00:00:00",0,0,0,0,0,"07:30:00","00:00:00",0,1]
["2019-11-21",{"$f":"IF(WEEKDAY(A30,2)=1,WEEKNUM(A29)*-1-MENY!$I$12,IF(WEEKDAY(A29,2)<7,LOOKUP(WEEKDAY(A29,2),MENY!$P$8:$P$14,MENY!$Q$8:$Q$14),\"\"))","v":"Tors"},null,null,null,null,"",0,{"$f":"IF(H29=11,\"Ordinær +\",IF(T29=1,IF(H29>0,LOOKUP(H29,MENY!$N$2:O38,MENY!$O$2:$O$18),IF(C29>0,IF(B29=\"Lør\",\"-\",\"Ordinær\"),\"-\")),\"Søndag\"))","v":"-"},null,0,0,null,0,"",null,null,"",null,1,"00:00:00",0,"00:00:00","00:00:00","00:00:00","00:00:00","00:00:00","00:00:00",0,0,0,0,0,"07:30:00","00:00:00",0,1]
["2019-11-22",{"$f":"IF(WEEKDAY(A31,2)=1,WEEKNUM(A30)*-1-MENY!$I$12,IF(WEEKDAY(A30,2)<7,LOOKUP(WEEKDAY(A30,2),MENY!$P$8:$P$14,MENY!$Q$8:$Q$14),\"\"))","v":"Fre"},null,null,null,null,"",0,{"$f":"IF(H30=11,\"Ordinær +\",IF(T30=1,IF(H30>0,LOOKUP(H30,MENY!$N$2:O39,MENY!$O$2:$O$18),IF(C30>0,IF(B30=\"Lør\",\"-\",\"Ordinær\"),\"-\")),\"Søndag\"))","v":"-"},null,0,0,null,0,"",null,null,"",null,1,"00:00:00",0,"00:00:00","00:00:00","00:00:00","00:00:00","00:00:00","00:00:00",0,0,0,0,0,"07:30:00","00:00:00",0,1]
["2019-11-23",{"$f":"IF(WEEKDAY(A32,2)=1,WEEKNUM(A31)*-1-MENY!$I$12,IF(WEEKDAY(A31,2)<7,LOOKUP(WEEKDAY(A31,2),MENY!$P$8:$P$14,MENY!$Q$8:$Q$14),\"\"))","v":"Lør"},null,null,null,null,"00:00:00",0,{"$f":"IF(H31=11,\"Ordinær +\",IF(T31=1,IF(H31>0,LOOKUP(H31,MENY!$N$2:O40,MENY!$O$2:$O$18),IF(C31>0,IF(B31=\"Lør\",\"-\",\"Ordinær\"),\"-\")),\"Søndag\"))","v":"-"},null,0,0,null,0,"",null,null,"",null,1,"","","00:00:00","","","","","",0,0,0,0,0,"07:30:00","00:00:00",0,1]
["2019-11-24",{"$f":"IF(WEEKDAY(A33,2)=1,WEEKNUM(A32)*-1-MENY!$I$12,IF(WEEKDAY(A32,2)<7,LOOKUP(WEEKDAY(A32,2),MENY!$P$8:$P$14,MENY!$Q$8:$Q$14),\"\"))","v":-48},null,null,null,null,"",0,{"$f":"IF(H32=11,\"Ordinær +\",IF(T32=1,IF(H32>0,LOOKUP(H32,MENY!$N$2:O41,MENY!$O$2:$O$18),IF(C32>0,IF(B32=\"Lør\",\"-\",\"Ordinær\"),\"-\")),\"Søndag\"))","v":"Søndag"},null,0,0,null,0,"",null,null,"",null,0,"00:00:00","","00:00:00","00:00:00","00:00:00","00:00:00","00:00:00","00:00:00",0,0,0,0,0,"07:30:00","00:00:00",0,1]
["2019-11-25",{"$f":"IF(WEEKDAY(A34,2)=1,WEEKNUM(A33)*-1-MENY!$I$12,IF(WEEKDAY(A33,2)<7,LOOKUP(WEEKDAY(A33,2),MENY!$P$8:$P$14,MENY!$Q$8:$Q$14),\"\"))","v":"Man"},null,null,null,null,"",0,{"$f":"IF(H33=11,\"Ordinær +\",IF(T33=1,IF(H33>0,LOOKUP(H33,MENY!$N$2:O42,MENY!$O$2:$O$18),IF(C33>0,IF(B33=\"Lør\",\"-\",\"Ordinær\"),\"-\")),\"Søndag\"))","v":"-"},null,0,0,null,0,"",null,null,"",null,1,"00:00:00",0,"00:00:00","00:00:00","00:00:00","00:00:00","00:00:00","00:00:00",0,0,0,0,0,"07:30:00","00:00:00",0,1]
["2019-11-26",{"$f":"IF(WEEKDAY(A35,2)=1,WEEKNUM(A34)*-1-MENY!$I$12,IF(WEEKDAY(A34,2)<7,LOOKUP(WEEKDAY(A34,2),MENY!$P$8:$P$14,MENY!$Q$8:$Q$14),\"\"))","v":"Tirs"},null,null,null,null,"",0,{"$f":"IF(H34=11,\"Ordinær +\",IF(T34=1,IF(H34>0,LOOKUP(H34,MENY!$N$2:O43,MENY!$O$2:$O$18),IF(C34>0,IF(B34=\"Lør\",\"-\",\"Ordinær\"),\"-\")),\"Søndag\"))","v":"-"},null,0,0,null,0,"",null,null,"",null,1,"00:00:00",0,"00:00:00","00:00:00","00:00:00","00:00:00","00:00:00","00:00:00",0,0,0,0,0,"07:30:00","00:00:00",0,1]
["2019-11-27",{"$f":"IF(WEEKDAY(A36,2)=1,WEEKNUM(A35)*-1-MENY!$I$12,IF(WEEKDAY(A35,2)<7,LOOKUP(WEEKDAY(A35,2),MENY!$P$8:$P$14,MENY!$Q$8:$Q$14),\"\"))","v":"Ons"},null,null,null,null,"",0,{"$f":"IF(H35=11,\"Ordinær +\",IF(T35=1,IF(H35>0,LOOKUP(H35,MENY!$N$2:O44,MENY!$O$2:$O$18),IF(C35>0,IF(B35=\"Lør\",\"-\",\"Ordinær\"),\"-\")),\"Søndag\"))","v":"-"},null,0,0,null,0,"",null,null,"",null,{"$f":"IF(A35>0,IF(WEEKDAY(A35-1)<7,1,0),\"\")","v":1},"00:00:00",0,"00:00:00","00:00:00","00:00:00","00:00:00","00:00:00","00:00:00",0,0,0,0,0,"07:30:00","00:00:00",0,1]
["2019-11-28",{"$f":"IF(WEEKDAY(A37,2)=1,WEEKNUM(A36)*-1-MENY!$I$12,IF(WEEKDAY(A36,2)<7,LOOKUP(WEEKDAY(A36,2),MENY!$P$8:$P$14,MENY!$Q$8:$Q$14),\"\"))","v":"Tors"},null,null,null,null,"",0,{"$f":"IF(H36=11,\"Ordinær +\",IF(T36=1,IF(H36>0,LOOKUP(H36,MENY!$N$2:O45,MENY!$O$2:$O$18),IF(C36>0,IF(B36=\"Lør\",\"-\",\"Ordinær\"),\"-\")),\"Søndag\"))","v":"-"},null,0,0,null,0,"",null,null,"",null,{"$f":"IF(A36>0,IF(WEEKDAY(A36-1)<7,1,0),\"\")","v":1},"00:00:00",0,"00:00:00","00:00:00","00:00:00","00:00:00","00:00:00","00:00:00",0,0,0,0,0,"07:30:00","00:00:00",0,1]
["2019-11-29",{"$f":"IF(WEEKDAY(A38,2)=1,WEEKNUM(A37)*-1-MENY!$I$12,IF(WEEKDAY(A37,2)<7,LOOKUP(WEEKDAY(A37,2),MENY!$P$8:$P$14,MENY!$Q$8:$Q$14),\"\"))","v":"Fre"},null,null,null,null,"",0,{"$f":"IF(H37=11,\"Ordinær +\",IF(T37=1,IF(H37>0,LOOKUP(H37,MENY!$N$2:O46,MENY!$O$2:$O$18),IF(C37>0,IF(B37=\"Lør\",\"-\",\"Ordinær\"),\"-\")),\"Søndag\"))","v":"-"},null,0,0,null,0,"",null,null,"",null,{"$f":"IF(A37>0,IF(WEEKDAY(A37-1)<7,1,0),\"\")","v":1},"00:00:00",0,"00:00:00","00:00:00","00:00:00","00:00:00","00:00:00","00:00:00",0,0,0,0,0,"07:30:00","00:00:00",0,1]
["2019-11-30",{"$f":"IF(WEEKDAY(A39,2)=1,WEEKNUM(A38)*-1-MENY!$I$12,IF(WEEKDAY(A38,2)<7,LOOKUP(WEEKDAY(A38,2),MENY!$P$8:$P$14,MENY!$Q$8:$Q$14),\"\"))","v":"Lør"},null,null,null,null,"00:00:00",0,{"$f":"IF(H38=11,\"Ordinær +\",IF(T38=1,IF(H38>0,LOOKUP(H38,MENY!$N$2:O47,MENY!$O$2:$O$18),IF(C38>0,IF(B38=\"Lør\",\"-\",\"Ordinær\"),\"-\")),\"Søndag\"))","v":"-"},null,0,0,null,0,"",null,null,"",null,{"$f":"IF(A38>0,IF(WEEKDAY(A38-1)<7,1,0),\"\")","v":1},"","","00:00:00","","","","","",0,0,0,0,0,"07:30:00","00:00:00",0,1]
[null,null,null,null,null,null,"",0,{"$f":"IF(A39>0,IF(H39=11,\"Ordinær +\",IF(T39=1,IF(H39>0,LOOKUP(H39,MENY!$N$2:O48,MENY!$O$2:$O$18),IF(C39>0,IF(B39=\"Lør\",\"-\",\"Ordinær\"),\"-\")),\"Søndag\")),\"-\")","v":"-"},null,0,0,null,0,"",null,null,"",null,{"$f":"IF(A39>0,IF(WEEKDAY(A39-1)<7,1,0),\"\")","v":""},"00:00:00","","00:00:00","00:00:00","00:00:00","00:00:00",{"$f":"IF(B39=\"Lør\",\"\",IF(T39=1,IF(H39=9,AH39,0),0))","v":"00:00:00"},"00:00:00",0,0,0,0,0,"07:30:00","00:00:00",0,1]
[null,null,null,"Sum for denne måned",null,null,{"$f":"SUM(G9:G39)*24","v":0},null,null,null,{"$f":"SUM(K9:K39)+N49","v":0},{"$f":"SUM(L9:L39)","v":0},{"$f":"SUM(M9:M39)","v":0},{"$f":"SUM(N9:N39)-U40-AG41-SUM(K40:M40)+N50","v":0},{"$f":"SUM(O9:O39)","v":0},"Fravær denne måned",null,null,null,null,{"$f":"SUM(U9:U39)*24","v":0},{"$f":"SUM(V9:V39)","v":0},{"$f":"SUM(W9:W39)*24","v":0},0,0,0,0,0,{"$f":"SUM(AC9:AC39)","v":0},{"$f":"SUM(AD9:AD39)","v":0},{"$f":"SUM(AE9:AE39)","v":0},{"$f":"SUM(AF9:AF39)","v":0},{"$f":"SUM(AG9:AG39)","v":0},"00:00:00"]
[null,null,null,"Overført fra forrige måned",null,null,null,null,null,null,null,null,null,{"$f":"OKT!N47","v":0},{"$f":"OKT!O42","v":0},"Type","Timer",null,null,null,null,null,null,null,null,null,null,null,null,null,null,"Sum deltidsfravær:",{"$f":"SUM(AC40:AG40)","v":0}]
[null,null,null,"Sum hittil i år",null,null,null,null,null,null,null,null,null,{"$f":"SUM(N40:N41)","v":0},{"$f":"SUM(O40:O41)","v":0},"06 Perm m/lønn",{"$f":"X40+AC40*-1","v":0}]
["Ferieregnskap",null,null,"Dager","Timeregnskap",null,null,null,null,null,null,null,null,"Timer",null,"07 Perm u/lønn",{"$f":"Y40+AD40*-1","v":0}]
["Disponible feriedager",null,null,{"$f":"OKT!D47","v":25},"Opptjent denne måneden",null,null,null,null,null,null,null,null,{"$f":"SUM(N9:N39)-AG41-(SUM(K40:M40))+N50","v":0},null,"08 Sykemelding",{"$f":"(Z40+AE40*-1)","v":0}]
["Brukt denne måned",null,null,{"$f":"V40*-1","v":0},"Avspasert denne måneden",null,null,null,null,null,null,null,null,{"$f":"U40","v":0},null,"09 Egenmelding",{"$f":"(AA40+AF40*-1)","v":0}]
["Endring i feriedager",null,null,null,"Utbetalt overtid denne måned",null,null,null,null,null,null,null,null,{"$f":"SUM(K40:M40)","v":0},null,"10 Sykt barn",{"$f":"(AB40+AG40*-1)","v":0}]
["Til gode",null,null,{"$f":"SUM(D44:D46)","v":25},"Til gode for avspasering",null,null,null,null,null,null,null,null,{"$f":"N42","v":0},null,"Sum -November",{"$f":"SUM(Q42:Q46)","v":0}]
[null,null,null,null,"Effektiv arbeidstid denne måned",null,null,null,null,null,null,null,null,{"$f":"G40+N44+AG41+N46-N50","v":0},null,"Hittil i år",{"$f":"Q47+OKT!Q48","v":0}]
[null,null,null,null,"Flexitid omgjort til overtid og utbetalt, denne måned"]
[null,null,null,null,"Annen korrigering av flexitid, OBS! skriv egen merknad"]
["Merknader"]
[]
[]
[]
[]
[]
["Overtid for utbetaling:",null,null,null,null,null,"Dato",null,null,null,null,null,null,null,"Dato"]
[null,null,null,"Timer med 50% tillegg :",{"$f":"K40","v":0}]
[null,null,null,"Timer med 100% tillegg:",{"$f":"L40","v":0}]
[null,null,null,"Timer med 133% tillegg:",{"$f":"M39","v":0},null,null,null,"Attestert",null,null,null,null,null,"Anvist"]
[]
[]
[null,null,null,null,null,null,null,null,null,null,null,null,null,null,null,{"$f":"MENY!D6","v":"Leder"}]
["© Ole Jørgen Klaussen - 2003",null,null,null,{"$f":"TODAY()","v":"2018-11-30"},{"$f":"YEAR(TODAY())","v":2018},null,null,null,null,null,null,null,null,null,null,"ole.klaussen@online.no"]

{"sheet":"DES","index":12,"n_rows":64,"n_cols":37,"rows_kept":64,"cut":false,"hidden":false,"merged":[[38,15,38,16],[25,15,25,16],[37,15,37,16],[30,15,30,16],[36,15,36,16],[31,15,31,16],[2,1,2,6],[8,15,8,16],[9,15,9,16],[10,15,10,16],[11,15,11,16],[6,3,6,4],[7,7,7,8],[5,7,6,16],[15,15,15,16],[20,15,20,16],[17,15,17,16],[18,15,18,16],[35,15,35,16],[26,15,26,16],[27,15,27,16],[28,15,28,16],[29,15,29,16],[34,15,34,16],[22,15,22,16],[23,15,23,16],[12,15,12,16],[16,15,16,16],[14,15,14,16],[13,15,13,16],[19,15,19,16],[21,15,21,16],[54,0,54,16],[24,15,24,16],[1,28,2,33],[59,14,59,16],[62,6,62,10],[55,0,55,16],[56,6,56,10],[56,14,56,16],[51,0,51,16],[52,0,52,16],[53,0,53,16],[32,15,32,16],[33,15,33,16],[5,19,5,22],[7,15,7,16],[2,15,2,16]]}
["Meny","JAN","FEB","MAR","APR","MAI","JUN",null,null,null,null,null,null,null,null,null,"Hjelp","Viktig når det gjelder overtid"]
["Året","JUL","AUG","SEP","OKT","NOV","DES",null,null,null,null,null,null,null,null,"Dato",null,"For at føringer av aktiv arbeidstid skal bli riktig"]
[null,{"$f":"MENY!D4","v":"Min bedrift"},null,null,null,null,null,null,"Desember -",null,null,null,null,{"$f":"MENY!P1","v":2019},null,{"$f":"TODAY()","v":"2018-11-30"},null,"er det nødvendig at all arbeidstid registreres."]
[null,"Timeliste","Navn:",{"$f":"MENY!D5","v":"Min timeliste"},null,null,"Sommer",null,null,null,"Stillingsbrøk:",{"$f":"MENY!I5","v":1},null,"Vinter",null,null,null,"Dette gjelder også overtid. Så registrer  når du ",null,null,null,null,null,null,null,null,null,null,null,null,null,null,null,null,null,"MERK!"]
[null,null,"Sommerlukking fra/til:",null,{"$f":"MENY!Q18","v":"2019-05-15"},{"$f":"MENY!Q19","v":"2019-09-14"},{"$f":"(MENY!F13-MENY!E13-MENY!I13)*MENY!I5","v":"07:30:00"},null,{"$f":"MENY!I13","v":"00:00:00"},"  <-arbeidstid->",null,null,{"$f":"MENY!I14","v":"00:00:00"},{"$f":"(MENY!F14-MENY!E14-MENY!I14)*MENY!I5","v":"07:30:00"},null,null,null,"kommer på jobb (inn) og når du er ferdig (ut)",null,null,null,null,null,null,null,null,null,null,null,null,null,null,null,null,null,"Les her"]
["År ",null,null,null,null,null,null,"Fyll ut i arbeids og fraværskode : 0=ordinær  1=Avspasere  2=Ferie  3=Tjeneste  4=Plussdag  5=Helligdag  6=Perm M/lønn  7=Perm U/lønn  8=Sykemelding  9=Egenmelding 10=Sykt barn 11=Ordinær+ , 12 = plusstid som overtid",null,null,null,null,null,null,null,null,null,"Dersom noe av tiden skal utbetales i overtid, så",null,"Arbeidsdata",null,null,null,null,null,null,null,null,6,7,8,9,10,null,null,"Syke-","Stillings"]
[{"$f":"N3","v":2019},{"$f":"WEEKNUM(A9)+MENY!I12","v":49},"I dag","Fravær pr dag",null,"I dag",null,null,null,null,null,null,null,null,null,null,null,"legg inn antall timer nederst på arket.",null,null,null,null,null,6,7,8,9,10,12,13,14,15,16,null,null,"melding","brøk"]
["DATO","UKENR                               og DAG","Inn","Ut","Inn","Ut","Ordinær","Arbeids og fraværskode",null,"Fravær",0.5,1,1.33,"Balanse","Timer i dag","Merknad ",null,"Huskeliste",null,"Arbeids dag","Avsp","Ferie","Tjeneste","Perm m-lønn","Perm u-lønn","Sykemelding","Egenmelding","Sykt barn","Perm m-lønn","Perm u-lønn","Sykemelding","Egenmelding","Sykt barn","Ordinær arbeidstid","Trekk for matpause","i prosent andel"]
[{"$f":"DATE(MENY!P1,12,1)","v":"2019-12-01"},{"$f":"IF(WEEKDAY(A10,2)=1,WEEKNUM(A9)*-1-MENY!$I$12,IF(WEEKDAY(A9,2)<7,LOOKUP(WEEKDAY(A9,2),MENY!$P$8:$P$14,MENY!$Q$8:$Q$14),\"\"))","v":-49},null,null,null,null,{"$f":"IF(H9=11,F9-C9-(E9-D9),IF(B9=\"Lør\",0,IF(H9=4,0,IF(H9=3,IF(T9>0,W9,\"\"),IF(H9=1,0, IF(C9>0,  AH9,       \"\"))))))","v":""},{"$f":"IF(B9=\"Lør\",IF(C9>0,4,0),0)","v":0},{"$f":"IF(H9=11,\"Ordinær +\",IF(T9=1,IF(H9>0,LOOKUP(H9,MENY!$N$2:O18,MENY!$O$2:$O$18),IF(C9>0,IF(B9=\"Lør\",\"-\",\"Ordinær\"),\"-\")),\"Søndag\"))","v":"Søndag"},null,{"$f":"IF(H9=12,IF(N9>=4,4,N9),0)","v":0},{"$f":"IF(H9=12,IF(N9>K9,N9-4,0),0)","v":0},null,{"$f":"IF(H9=11,0,IF(T9=1,IF(H9=4,((F9-C9)-(E9-D9))*24,IF(C9>0,(F9-C9-(E9-D9)-G9-AI9)*24,0)),0))","v":0},{"$f":"IF(F9>0,G9*24+N9,\"\")","v":""},null,null,{"$f":"IF(O9=\"\",\"\",\"Husk, fordel timer til prosjekter\")","v":""},null,{"$f":"IF(WEEKDAY(A9-1)<7,1,0)","v":0},{"$f":"IF(B9=\"Lør\",\"\",IF(T9=1,IF(H9=1,AH9,0),0))","v":"00:00:00"},{"$f":"IF(T9=1,IF(B9=\"lør\",\"\",IF(H9=2,1,0)),\"\")","v":""},{"$f":"IF(T9=1,IF(H9=3,AH9,0),0)","v":"00:00:00"},{"$f":"IF(B9=\"lør\",\"\",IF(T9=1,IF(H9=6,AH9,0),0))","v":"00:00:00"},{"$f":"IF(B9=\"Lør\",\"\",IF(T9=1,IF(H9=7,AH9,0),0))","v":"00:00:00"},{"$f":"IF(AJ9>0,IF(C9>0,    (AH9*AJ9)/(1-AJ9),0),           IF(B9=\"Lør\",\"\",IF(T9=1,IF(H9=8,AH9,0),0)))","v":"00:00:00"},{"$f":"IF(B9=\"Lør\",\"\",IF(T9=1,IF(H9=9,AH9,0),0))","v":"00:00:00"},{"$f":"IF(B9=\"Lør\",\"\",IF(T9=1,IF(H9=10,AH9,0),0))","v":"00:00:00"},{"$f":"IF(J9=6,N9,0)","v":0},{"$f":"IF(J9=7,N9,0)","v":0},{"$f":"IF(J9=8,N9,0)","v":0},{"$f":"IF(J9=9,N9,0)","v":0},{"$f":"IF(J9=10,N9,0)","v":0},{"$f":"((IF(A9<$F$5+1,IF(A9>$E$5-1,$G$5,$N$5),$N$5))*(1-AJ9))*(AK9)","v":"07:30:00"},{"$f":"IF(A9<$F$5+1,IF(A9>$E$5-1,$I$5,$M$5),$M$5)","v":"00:00:00"},{"$f":"NOV!AJ39","v":0},{"$f":"NOV!AK39","v":1}]
[{"$f":"A9+1","v":"2019-12-02"},{"$f":"IF(WEEKDAY(A11,2)=1,WEEKNUM(A10)*-1-MENY!$I$12,IF(WEEKDAY(A10,2)<7,LOOKUP(WEEKDAY(A10,2),MENY!$P$8:$P$14,MENY!$Q$8:$Q$14),\"\"))","v":"Man"},null,null,null,null,{"$f":"IF(H10=11,F10-C10-(E10-D10),IF(B10=\"Lør\",0,IF(H10=4,0,IF(H10=3,IF(T10>0,W10,\"\"),IF(H10=1,0, IF(C10>0,  AH10,       \"\"))))))","v":""},0,{"$f":"IF(H10=11,\"Ordinær +\",IF(T10=1,IF(H10>0,LOOKUP(H10,MENY!$N$2:O19,MENY!$O$2:$O$18),IF(C10>0,IF(B10=\"Lør\",\"-\",\"Ordinær\"),\"-\")),\"Søndag\"))","v":"-"},null,{"$f":"IF(H10=12,IF(N10>=4,4,N10),0)","v":0},{"$f":"IF(H10=12,IF(N10>K10,N10-4,0),0)","v":0},null,{"$f":"IF(H10=11,0,IF(T10=1,IF(H10=4,((F10-C10)-(E10-D10))*24,IF(C10>0,(F10-C10-(E10-D10)-G10-AI10)*24,0)),0))","v":0},{"$f":"IF(F10>0,G10*24+N10,\"\")","v":""},null,null,{"$f":"IF(O10=\"\",\"\",\"Husk, fordel timer til prosjekter\")","v":""},null,{"$f":"IF(WEEKDAY(A10-1)<7,1,0)","v":1},{"$f":"IF(B10=\"Lør\",\"\",IF(T10=1,IF(H10=1,AH10,0),0))","v":"00:00:00"},0,{"$f":"IF(T10=1,IF(H10=3,AH10,0),0)","v":"00:00:00"},{"$f":"IF(B10=\"lør\",\"\",IF(T10=1,IF(H10=6,AH10,0),0))","v":"00:00:00"},{"$f":"IF(B10=\"Lør\",\"\",IF(T10=1,IF(H10=7,AH10,0),0))","v":"00:00:00"},{"$f":"IF(AJ10>0,IF(C10>0,    (AH10*AJ10)/(1-AJ10),0),           IF(B10=\"Lør\",\"\",IF(T10=1,IF(H10=8,AH10,0),0)))","v":"00:00:00"},{"$f":"IF(B10=\"Lør\",\"\",IF(T10=1,IF(H10=9,AH10,0),0))","v":"00:00:00"},{"$f":"IF(B10=\"Lør\",\"\",IF(T10=1,IF(H10=10,AH10,0),0))","v":"00:00:00"},0,0,0,0,0,{"$f":"((IF(A10<$F$5+1,IF(A10>$E$5-1,$G$5,$N$5),$N$5))*(1-AJ10))*(AK10)","v":"07:30:00"},{"$f":"IF(A10<$F$5+1,IF(A10>$E$5-1,$I$5,$M$5),$M$5)","v":"00:00:00"},{"$f":"AJ9","v":0},{"$f":"AK9","v":1}]
[{"$f":"A10+1","v":"2019-12-03"},{"$f":"IF(WEEKDAY(A12,2)=1,WEEKNUM(A11)*-1-MENY!$I$12,IF(WEEKDAY(A11,2)<7,LOOKUP(WEEKDAY(A11,2),MENY!$P$8:$P$14,MENY!$Q$8:$Q$14),\"\"))","v":"Tirs"},null,null,null,null,{"$f":"IF(H11=11,F11-C11-(E11-D11),IF(B11=\"Lør\",0,IF(H11=4,0,IF(H11=3,IF(T11>0,W11,\"\"),IF(H11=1,0, IF(C11>0,  AH11,       \"\"))))))","v":""},0,{"$f":"IF(H11=11,\"Ordinær +\",IF(T11=1,IF(H11>0,LOOKUP(H11,MENY!$N$2:O20,MENY!$O$2:$O$18),IF(C11>0,IF(B11=\"Lør\",\"-\",\"Ordinær\"),\"-\")),\"Søndag\"))","v":"-"},null,0,0,null,0,"",null,null,"",null,1,"00:00:00",0,"00:00:00","00:00:00","00:00:00","00:00:00","00:00:00","00:00:00",0,0,0,0,0,"07:30:00","00:00:00",{"$f":"AJ10","v":0},{"$f":"AK10","v":1}]
["2019-12-04",{"$f":"IF(WEEKDAY(A13,2)=1,WEEKNUM(A12)*-1-MENY!$I$12,IF(WEEKDAY(A12,2)<7,LOOKUP(WEEKDAY(A12,2),MENY!$P$8:$P$14,MENY!$Q$8:$Q$14),\"\"))","v":"Ons"},null,null,null,null,"",0,{"$f":"IF(H12=11,\"Ordinær +\",IF(T12=1,IF(H12>0,LOOKUP(H12,MENY!$N$2:O21,MENY!$O$2:$O$18),IF(C12>0,IF(B12=\"Lør\",\"-\",\"Ordinær\"),\"-\")),\"Søndag\"))","v":"-"},null,0,0,null,0,"",null,null,"",null,1,"00:00:00",0,"00:00:00","00:00:00","00:00:00","00:00:00","00:00:00","00:00:00",0,0,0,0,0,"07:30:00","00:00:00",0,1]
["2019-12-05",{"$f":"IF(WEEKDAY(A14,2)=1,WEEKNUM(A13)*-1-MENY!$I$12,IF(WEEKDAY(A13,2)<7,LOOKUP(WEEKDAY(A13,2),MENY!$P$8:$P$14,MENY!$Q$8:$Q$14),\"\"))","v":"Tors"},null,null,null,null,"",0,{"$f":"IF(H13=11,\"Ordinær +\",IF(T13=1,IF(H13>0,LOOKUP(H13,MENY!$N$2:O22,MENY!$O$2:$O$18),IF(C13>0,IF(B13=\"Lør\",\"-\",\"Ordinær\"),\"-\")),\"Søndag\"))","v":"-"},null,0,0,null,0,"",null,null,"",null,1,"00:00:00",0,"00:00:00","00:00:00","00:00:00","00:00:00","00:00:00","00:00:00",0,0,0,0,0,"07:30:00","00:00:00",0,1]
["2019-12-06",{"$f":"IF(WEEKDAY(A15,2)=1,WEEKNUM(A14)*-1-MENY!$I$12,IF(WEEKDAY(A14,2)<7,LOOKUP(WEEKDAY(A14,2),MENY!$P$8:$P$14,MENY!$Q$8:$Q$14),\"\"))","v":"Fre"},null,null,null,null,"",0,{"$f":"IF(H14=11,\"Ordinær +\",IF(T14=1,IF(H14>0,LOOKUP(H14,MENY!$N$2:O23,MENY!$O$2:$O$18),IF(C14>0,IF(B14=\"Lør\",\"-\",\"Ordinær\"),\"-\")),\"Søndag\"))","v":"-"},null,0,0,null,0,"",null,null,"",null,1,"00:00:00",0,"00:00:00","00:00:00","00:00:00","00:00:00","00:00:00","00:00:00",0,0,0,0,0,"07:30:00","00:00:00",0,1]
["2019-12-07",{"$f":"IF(WEEKDAY(A16,2)=1,WEEKNUM(A15)*-1-MENY!$I$12,IF(WEEKDAY(A15,2)<7,LOOKUP(WEEKDAY(A15,2),MENY!$P$8:$P$14,MENY!$Q$8:$Q$14),\"\"))","v":"Lør"},null,null,null,null,"00:00:00",0,{"$f":"IF(H15=11,\"Ordinær +\",IF(T15=1,IF(H15>0,LOOKUP(H15,MENY!$N$2:O24,MENY!$O$2:$O$18),IF(C15>0,IF(B15=\"Lør\",\"-\",\"Ordinær\"),\"-\")),\"Søndag\"))","v":"-"},null,0,0,null,0,"",null,null,"",null,1,"","","00:00:00","","","","","",0,0,0,0,0,"07:30:00","00:00:00",0,1]
["2019-12-08",{"$f":"IF(WEEKDAY(A17,2)=1,WEEKNUM(A16)*-1-MENY!$I$12,IF(WEEKDAY(A16,2)<7,LOOKUP(WEEKDAY(A16,2),MENY!$P$8:$P$14,MENY!$Q$8:$Q$14),\"\"))","v":-50},null,null,null,null,"",0,{"$f":"IF(H16=11,\"Ordinær +\",IF(T16=1,IF(H16>0,LOOKUP(H16,MENY!$N$2:O25,MENY!$O$2:$O$18),IF(C16>0,IF(B16=\"Lør\",\"-\",\"Ordinær\"),\"-\")),\"Søndag\"))","v":"Søndag"},null,0,0,null,0,"",null,null,"",null,0,"00:00:00","","00:00:00","00:00:00","00:00:00","00:00:00","00:00:00","00:00:00",0,0,0,0,0,"07:30:00","00:00:00",0,1]
["2019-12-09",{"$f":"IF(WEEKDAY(A18,2)=1,WEEKNUM(A17)*-1-MENY!$I$12,IF(WEEKDAY(A17,2)<7,LOOKUP(WEEKDAY(A17,2),MENY!$P$8:$P$14,MENY!$Q$8:$Q$14),\"\"))","v":"Man"},null,null,null,null,"",0,{"$f":"IF(H17=11,\"Ordinær +\",IF(T17=1,IF(H17>0,LOOKUP(H17,MENY!$N$2:O26,MENY!$O$2:$O$18),IF(C17>0,IF(B17=\"Lør\",\"-\",\"Ordinær\"),\"-\")),\"Søndag\"))","v":"-"},null,0,0,null,0,"",null,null,"",null,1,"00:00:00",0,"00:00:00","00:00:00","00:00:00","00:00:00","00:00:00","00:00:00",0,0,0,0,0,"07:30:00","00:00:00",0,1]
["2019-12-10",{"$f":"IF(WEEKDAY(A19,2)=1,WEEKNUM(A18)*-1-MENY!$I$12,IF(WEEKDAY(A18,2)<7,LOOKUP(WEEKDAY(A18,2),MENY!$P$8:$P$14,MENY!$Q$8:$Q$14),\"\"))","v":"Tirs"},null,null,null,null,"",0,{"$f":"IF(H18=11,\"Ordinær +\",IF(T18=1,IF(H18>0,LOOKUP(H18,MENY!$N$2:O27,MENY!$O$2:$O$18),IF(C18>0,IF(B18=\"Lør\",\"-\",\"Ordinær\"),\"-\")),\"Søndag\"))","v":"-"},null,0,0,null,0,"",null,null,"",null,1,"00:00:00",0,"00:00:00","00:00:00","00:00:00","00:00:00","00:00:00","00:00:00",0,0,0,0,0,"07:30:00","00:00:00",0,1]
["2019-12-11",{"$f":"IF(WEEKDAY(A20,2)=1,WEEKNUM(A19)*-1-MENY!$I$12,IF(WEEKDAY(A19,2)<7,LOOKUP(WEEKDAY(A19,2),MENY!$P$8:$P$14,MENY!$Q$8:$Q$14),\"\"))","v":"Ons"},null,null,null,null,"",0,{"$f":"IF(H19=11,\"Ordinær +\",IF(T19=1,IF(H19>0,LOOKUP(H19,MENY!$N$2:O28,MENY!$O$2:$O$18),IF(C19>0,IF(B19=\"Lør\",\"-\",\"Ordinær\"),\"-\")),\"Søndag\"))","v":"-"},null,0,0,null,0,"",null,null,"",null,1,"00:00:00",0,"00:00:00","00:00:00","00:00:00","00:00:00","00:00:00","00:00:00",0,0,0,0,0,"07:30:00","00:00:00",0,1]
["2019-12-12",{"$f":"IF(WEEKDAY(A21,2)=1,WEEKNUM(A20)*-1-MENY!$I$12,IF(WEEKDAY(A20,2)<7,LOOKUP(WEEKDAY(A20,2),MENY!$P$8:$P$14,MENY!$Q$8:$Q$14),\"\"))","v":"Tors"},null,null,null,null,"",0,{"$f":"IF(H20=11,\"Ordinær +\",IF(T20=1,IF(H20>0,LOOKUP(H20,MENY!$N$2:O29,MENY!$O$2:$O$18),IF(C20>0,IF(B20=\"Lør\",\"-\",\"Ordinær\"),\"-\")),\"Søndag\"))","v":"-"},null,0,0,null,0,"",null,null,"",null,1,"00:00:00",0,"00:00:00","00:00:00","00:00:00","00:00:00","00:00:00","00:00:00",0,0,0,0,0,"07:30:00","00:00:00",0,1]
["2019-12-13",{"$f":"IF(WEEKDAY(A22,2)=1,WEEKNUM(A21)*-1-MENY!$I$12,IF(WEEKDAY(A21,2)<7,LOOKUP(WEEKDAY(A21,2),MENY!$P$8:$P$14,MENY!$Q$8:$Q$14),\"\"))","v":"Fre"},null,null,null,null,"",0,{"$f":"IF(H21=11,\"Ordinær +\",IF(T21=1,IF(H21>0,LOOKUP(H21,MENY!$N$2:O30,MENY!$O$2:$O$18),IF(C21>0,IF(B21=\"Lør\",\"-\",\"Ordinær\"),\"-\")),\"Søndag\"))","v":"-"},null,0,0,null,0,"",null,null,"",null,1,"00:00:00",0,"00:00:00","00:00:00","00:00:00","00:00:00","00:00:00","00:00:00",0,0,0,0,0,"07:30:00","00:00:00",0,1]
["2019-12-14",{"$f":"IF(WEEKDAY(A23,2)=1,WEEKNUM(A22)*-1-MENY!$I$12,IF(WEEKDAY(A22,2)<7,LOOKUP(WEEKDAY(A22,2),MENY!$P$8:$P$14,MENY!$Q$8:$Q$14),\"\"))","v":"Lør"},null,null,null,null,"00:00:00",0,{"$f":"IF(H22=11,\"Ordinær +\",IF(T22=1,IF(H22>0,LOOKUP(H22,MENY!$N$2:O31,MENY!$O$2:$O$18),IF(C22>0,IF(B22=\"Lør\",\"-\",\"Ordinær\"),\"-\")),\"Søndag\"))","v":"-"},null,0,0,null,0,"",null,null,"",null,1,"","","00:00:00","","","","","",0,0,0,0,0,"07:30:00","00:00:00",0,1]
["2019-12-15",{"$f":"IF(WEEKDAY(A24,2)=1,WEEKNUM(A23)*-1-MENY!$I$12,IF(WEEKDAY(A23,2)<7,LOOKUP(WEEKDAY(A23,2),MENY!$P$8:$P$14,MENY!$Q$8:$Q$14),\"\"))","v":-51},null,null,null,null,"",0,{"$f":"IF(H23=11,\"Ordinær +\",IF(T23=1,IF(H23>0,LOOKUP(H23,MENY!$N$2:O32,MENY!$O$2:$O$18),IF(C23>0,IF(B23=\"Lør\",\"-\",\"Ordinær\"),\"-\")),\"Søndag\"))","v":"Søndag"},null,0,0,null,0,"",null,null,"",null,0,"00:00:00","","00:00:00","00:00:00","00:00:00","00:00:00","00:00:00","00:00:00",0,0,0,0,0,"07:30:00","00:00:00",0,1]
["2019-12-16",{"$f":"IF(WEEKDAY(A25,2)=1,WEEKNUM(A24)*-1-MENY!$I$12,IF(WEEKDAY(A24,2)<7,LOOKUP(WEEKDAY(A24,2),MENY!$P$8:$P$14,MENY!$Q$8:$Q$14),\"\"))","v":"Man"},null,null,null,null,"",0,{"$f":"IF(H24=11,\"Ordinær +\",IF(T24=1,IF(H24>0,LOOKUP(H24,MENY!$N$2:O33,MENY!$O$2:$O$18),IF(C24>0,IF(B24=\"Lør\",\"-\",\"Ordinær\"),\"-\")),\"Søndag\"))","v":"-"},null,0,0,null,0,"",null,null,"",null,1,"00:00:00",0,"00:00:00","00:00:00","00:00:00","00:00:00","00:00:00","00:00:00",0,0,0,0,0,"07:30:00","00:00:00",0,1]
["2019-12-17",{"$f":"IF(WEEKDAY(A26,2)=1,WEEKNUM(A25)*-1-MENY!$I$12,IF(WEEKDAY(A25,2)<7,LOOKUP(WEEKDAY(A25,2),MENY!$P$8:$P$14,MENY!$Q$8:$Q$14),\"\"))","v":"Tirs"},null,null,null,null,"",0,{"$f":"IF(H25=11,\"Ordinær +\",IF(T25=1,IF(H25>0,LOOKUP(H25,MENY!$N$2:O34,MENY!$O$2:$O$18),IF(C25>0,IF(B25=\"Lør\",\"-\",\"Ordinær\"),\"-\")),\"Søndag\"))","v":"-"},null,0,0,null,0,"",null,null,"",null,1,"00:00:00",0,"00:00:00","00:00:00","00:00:00","00:00:00","00:00:00","00:00:00",0,0,0,0,0,"07:30:00","00:00:00",0,1]
["2019-12-18",{"$f":"IF(WEEKDAY(A27,2)=1,WEEKNUM(A26)*-1-MENY!$I$12,IF(WEEKDAY(A26,2)<7,LOOKUP(WEEKDAY(A26,2),MENY!$P$8:$P$14,MENY!$Q$8:$Q$14),\"\"))","v":"Ons"},null,null,null,null,"",0,{"$f":"IF(H26=11,\"Ordinær +\",IF(T26=1,IF(H26>0,LOOKUP(H26,MENY!$N$2:O35,MENY!$O$2:$O$18),IF(C26>0,IF(B26=\"Lør\",\"-\",\"Ordinær\"),\"-\")),\"Søndag\"))","v":"-"},null,0,0,null,0,"",null,null,"",null,1,"00:00:00",0,"00:00:00","00:00:00","00:00:00","00:00:00","00:00:00","00:00:00",0,0,0,0,0,"07:30:00","00:00:00",0,1]
["2019-12-19",{"$f":"IF(WEEKDAY(A28,2)=1,WEEKNUM(A27)*-1-MENY!$I$12,IF(WEEKDAY(A27,2)<7,LOOKUP(WEEKDAY(A27,2),MENY!$P$8:$P$14,MENY!$Q$8:$Q$14),\"\"))","v":"Tors"},null,null,null,null,"",0,{"$f":"IF(H27=11,\"Ordinær +\",IF(T27=1,IF(H27>0,LOOKUP(H27,MENY!$N$2:O36,MENY!$O$2:$O$18),IF(C27>0,IF(B27=\"Lør\",\"-\",\"Ordinær\"),\"-\")),\"Søndag\"))","v":"-"},null,0,0,null,0,"",null,null,"",null,1,"00:00:00",0,"00:00:00","00:00:00","00:00:00","00:00:00","00:00:00","00:00:00",0,0,0,0,0,"07:30:00","00:00:00",0,1]
["2019-12-20",{"$f":"IF(WEEKDAY(A29,2)=1,WEEKNUM(A28)*-1-MENY!$I$12,IF(WEEKDAY(A28,2)<7,LOOKUP(WEEKDAY(A28,2),MENY!$P$8:$P$14,MENY!$Q$8:$Q$14),\"\"))","v":"Fre"},null,null,null,null,"",0,{"$f":"IF(H28=11,\"Ordinær +\",IF(T28=1,IF(H28>0,LOOKUP(H28,MENY!$N$2:O37,MENY!$O$2:$O$18),IF(C28>0,IF(B28=\"Lør\",\"-\",\"Ordinær\"),\"-\")),\"Søndag\"))","v":"-"},null,0,0,null,0,"",null,null,"",null,1,"00:00:00",0,"00:00:00","00:00:00","00:00:00","00:00:00","00:00:00","00:00:00",0,0,0,0,0,"07:30:00","00:00:00",0,1]
["2019-12-21",{"$f":"IF(WEEKDAY(A30,2)=1,WEEKNUM(A29)*-1-MENY!$I$12,IF(WEEKDAY(A29,2)<7,LOOKUP(WEEKDAY(A29,2),MENY!$P$8:$P$14,MENY!$Q$8:$Q$14),\"\"))","v":"Lør"},null,null,null,null,"00:00:00",0,{"$f":"IF(H29=11,\"Ordinær +\",IF(T29=1,IF(H29>0,LOOKUP(H29,MENY!$N$2:O38,MENY!$O$2:$O$18),IF(C29>0,IF(B29=\"Lør\",\"-\",\"Ordinær\"),\"-\")),\"Søndag\"))","v":"-"},null,0,0,null,0,"",null,null,"",null,1,"","","00:00:00","","","","","",0,0,0,0,0,"07:30:00","00:00:00",0,1]
["2019-12-22",{"$f":"IF(WEEKDAY(A31,2)=1,WEEKNUM(A30)*-1-MENY!$I$12,IF(WEEKDAY(A30,2)<7,LOOKUP(WEEKDAY(A30,2),MENY!$P$8:$P$14,MENY!$Q$8:$Q$14),\"\"))","v":-52},null,null,null,null,"",0,{"$f":"IF(H30=11,\"Ordinær +\",IF(T30=1,IF(H30>0,LOOKUP(H30,MENY!$N$2:O39,MENY!$O$2:$O$18),IF(C30>0,IF(B30=\"Lør\",\"-\",\"Ordinær\"),\"-\")),\"Søndag\"))","v":"Søndag"},null,0,0,null,0,"",null,null,"",null,0,"00:00:00","","00:00:00","00:00:00","00:00:00","00:00:00","00:00:00","00:00:00",0,0,0,0,0,"07:30:00","00:00:00",0,1]
["2019-12-23",{"$f":"IF(WEEKDAY(A32,2)=1,WEEKNUM(A31)*-1-MENY!$I$12,IF(WEEKDAY(A31,2)<7,LOOKUP(WEEKDAY(A31,2),MENY!$P$8:$P$14,MENY!$Q$8:$Q$14),\"\"))","v":"Man"},null,null,null,null,"",0,{"$f":"IF(H31=11,\"Ordinær +\",IF(T31=1,IF(H31>0,LOOKUP(H31,MENY!$N$2:O40,MENY!$O$2:$O$18),IF(C31>0,IF(B31=\"Lør\",\"-\",\"Ordinær\"),\"-\")),\"Søndag\"))","v":"-"},null,0,0,null,0,"",null,null,"",null,1,"00:00:00",0,"00:00:00","00:00:00","00:00:00","00:00:00","00:00:00","00:00:00",0,0,0,0,0,"07:30:00","00:00:00",0,1]
["2019-12-24",{"$f":"IF(WEEKDAY(A33,2)=1,WEEKNUM(A32)*-1-MENY!$I$12,IF(WEEKDAY(A32,2)<7,LOOKUP(WEEKDAY(A32,2),MENY!$P$8:$P$14,MENY!$Q$8:$Q$14),\"\"))","v":"Tirs"},null,null,null,null,"",0,{"$f":"IF(H32=11,\"Ordinær +\",IF(T32=1,IF(H32>0,LOOKUP(H32,MENY!$N$2:O41,MENY!$O$2:$O$18),IF(C32>0,IF(B32=\"Lør\",\"-\",\"Ordinær\"),\"-\")),\"Søndag\"))","v":"-"},null,0,0,null,0,"",null,null,"",null,1,"00:00:00",0,"00:00:00","00:00:00","00:00:00","00:00:00","00:00:00","00:00:00",0,0,0,0,0,"07:30:00","00:00:00",0,1]
["2019-12-25",{"$f":"IF(WEEKDAY(A34,2)=1,WEEKNUM(A33)*-1-MENY!$I$12,IF(WEEKDAY(A33,2)<7,LOOKUP(WEEKDAY(A33,2),MENY!$P$8:$P$14,MENY!$Q$8:$Q$14),\"\"))","v":"Ons"},null,null,null,null,"",0,{"$f":"IF(H33=11,\"Ordinær +\",IF(T33=1,IF(H33>0,LOOKUP(H33,MENY!$N$2:O42,MENY!$O$2:$O$18),IF(C33>0,IF(B33=\"Lør\",\"-\",\"Ordinær\"),\"-\")),\"Søndag\"))","v":"-"},null,0,0,null,0,"",null,null,"",null,1,"00:00:00",0,"00:00:00","00:00:00","00:00:00","00:00:00","00:00:00","00:00:00",0,0,0,0,0,"07:30:00","00:00:00",0,1]
["2019-12-26",{"$f":"IF(WEEKDAY(A35,2)=1,WEEKNUM(A34)*-1-MENY!$I$12,IF(WEEKDAY(A34,2)<7,LOOKUP(WEEKDAY(A34,2),MENY!$P$8:$P$14,MENY!$Q$8:$Q$14),\"\"))","v":"Tors"},null,null,null,null,"",0,{"$f":"IF(H34=11,\"Ordinær +\",IF(T34=1,IF(H34>0,LOOKUP(H34,MENY!$N$2:O43,MENY!$O$2:$O$18),IF(C34>0,IF(B34=\"Lør\",\"-\",\"Ordinær\"),\"-\")),\"Søndag\"))","v":"-"},null,0,0,null,0,"",null,null,"",null,1,"00:00:00",0,"00:00:00","00:00:00","00:00:00","00:00:00","00:00:00","00:00:00",0,0,0,0,0,"07:30:00","00:00:00",0,1]
["2019-12-27",{"$f":"IF(WEEKDAY(A36,2)=1,WEEKNUM(A35)*-1-MENY!$I$12,IF(WEEKDAY(A35,2)<7,LOOKUP(WEEKDAY(A35,2),MENY!$P$8:$P$14,MENY!$Q$8:$Q$14),\"\"))","v":"Fre"},null,null,null,null,"",0,{"$f":"IF(H35=11,\"Ordinær +\",IF(T35=1,IF(H35>0,LOOKUP(H35,MENY!$N$2:O44,MENY!$O$2:$O$18),IF(C35>0,IF(B35=\"Lør\",\"-\",\"Ordinær\"),\"-\")),\"Søndag\"))","v":"-"},null,0,0,null,0,"",null,null,"",null,{"$f":"IF(A35>0,IF(WEEKDAY(A35-1)<7,1,0),\"\")","v":1},"00:00:00",0,"00:00:00","00:00:00","00:00:00","00:00:00","00:00:00","00:00:00",0,0,0,0,0,"07:30:00","00:00:00",0,1]
["2019-12-28",{"$f":"IF(WEEKDAY(A37,2)=1,WEEKNUM(A36)*-1-MENY!$I$12,IF(WEEKDAY(A36,2)<7,LOOKUP(WEEKDAY(A36,2),MENY!$P$8:$P$14,MENY!$Q$8:$Q$14),\"\"))","v":"Lør"},null,null,null,null,"00:00:00",0,{"$f":"IF(H36=11,\"Ordinær +\",IF(T36=1,IF(H36>0,LOOKUP(H36,MENY!$N$2:O45,MENY!$O$2:$O$18),IF(C36>0,IF(B36=\"Lør\",\"-\",\"Ordinær\"),\"-\")),\"Søndag\"))","v":"-"},null,0,0,null,0,"",null,null,"",null,{"$f":"IF(A36>0,IF(WEEKDAY(A36-1)<7,1,0),\"\")","v":1},"","","00:00:00","","","","","",0,0,0,0,0,"07:30:00","00:00:00",0,1]
["2019-12-29",{"$f":"IF(WEEKDAY(A38,2)=1,WEEKNUM(A37)*-1-MENY!$I$12,IF(WEEKDAY(A37,2)<7,LOOKUP(WEEKDAY(A37,2),MENY!$P$8:$P$14,MENY!$Q$8:$Q$14),\"\"))","v":-53},null,null,null,null,"",0,{"$f":"IF(H37=11,\"Ordinær +\",IF(T37=1,IF(H37>0,LOOKUP(H37,MENY!$N$2:O46,MENY!$O$2:$O$18),IF(C37>0,IF(B37=\"Lør\",\"-\",\"Ordinær\"),\"-\")),\"Søndag\"))","v":"Søndag"},null,0,0,null,0,"",null,null,"",null,{"$f":"IF(A37>0,IF(WEEKDAY(A37-1)<7,1,0),\"\")","v":0},"00:00:00","","00:00:00","00:00:00","00:00:00","00:00:00","00:00:00","00:00:00",0,0,0,0,0,"07:30:00","00:00:00",0,1]
["2019-12-30",{"$f":"IF(WEEKDAY(A39,2)=1,WEEKNUM(A38)*-1-MENY!$I$12,IF(WEEKDAY(A38,2)<7,LOOKUP(WEEKDAY(A38,2),MENY!$P$8:$P$14,MENY!$Q$8:$Q$14),\"\"))","v":"Man"},null,null,null,null,"",0,{"$f":"IF(H38=11,\"Ordinær +\",IF(T38=1,IF(H38>0,LOOKUP(H38,MENY!$N$2:O47,MENY!$O$2:$O$18),IF(C38>0,IF(B38=\"Lør\",\"-\",\"Ordinær\"),\"-\")),\"Søndag\"))","v":"-"},null,0,0,null,0,"",null,null,"",null,{"$f":"IF(A38>0,IF(WEEKDAY(A38-1)<7,1,0),\"\")","v":1},"00:00:00",0,"00:00:00","00:00:00","00:00:00","00:00:00","00:00:00","00:00:00",0,0,0,0,0,"07:30:00","00:00:00",0,1]
["2019-12-31",{"$f":"IF(WEEKDAY(A40,2)=1,WEEKNUM(A39)*-1-MENY!$I$12,IF(WEEKDAY(A39,2)<7,LOOKUP(WEEKDAY(A39,2),MENY!$P$8:$P$14,MENY!$Q$8:$Q$14),\"\"))","v":"Tirs"},null,null,null,null,"",0,{"$f":"IF(A39>0,IF(H39=11,\"Ordinær +\",IF(T39=1,IF(H39>0,LOOKUP(H39,MENY!$N$2:O48,MENY!$O$2:$O$18),IF(C39>0,IF(B39=\"Lør\",\"-\",\"Ordinær\"),\"-\")),\"Søndag\")),\"-\")","v":"-"},null,0,0,null,0,"",null,null,"",null,{"$f":"IF(A39>0,IF(WEEKDAY(A39-1)<7,1,0),\"\")","v":1},"00:00:00",0,"00:00:00","00:00:00","00:00:00","00:00:00",{"$f":"IF(B39=\"Lør\",\"\",IF(T39=1,IF(H39=9,AH39,0),0))","v":"00:00:00"},"00:00:00",0,0,0,0,0,"07:30:00","00:00:00",0,1]
[null,null,null,"Sum for denne måned",null,null,{"$f":"SUM(G9:G39)*24","v":0},null,null,null,{"$f":"SUM(K9:K39)+N49","v":0},{"$f":"SUM(L9:L39)","v":0},{"$f":"SUM(M9:M39)","v":0},{"$f":"SUM(N9:N39)-U40-AG41-SUM(K40:M40)+N50","v":0},{"$f":"SUM(O9:O39)","v":0},"Fravær denne måned",null,null,null,null,{"$f":"SUM(U9:U39)*24","v":0},{"$f":"SUM(V9:V39)","v":0},{"$f":"SUM(W9:W39)*24","v":0},0,0,0,0,0,{"$f":"SUM(AC9:AC39)","v":0},{"$f":"SUM(AD9:AD39)","v":0},{"$f":"SUM(AE9:AE39)","v":0},{"$f":"SUM(AF9:AF39)","v":0},{"$f":"SUM(AG9:AG39)","v":0}]
[null,null,null,"Overført fra forrige måned",null,null,null,null,null,null,null,null,null,{"$f":"NOV!N47","v":0},{"$f":"NOV!O42","v":0},"Type","Timer",null,null,null,null,null,null,null,null,null,null,null,null,null,null,"Sum deltidsfravær:",{"$f":"SUM(AC40:AG40)","v":0}]
[null,null,null,"Sum hittil i år",null,null,null,null,null,null,null,null,null,{"$f":"SUM(N40:N41)","v":0},{"$f":"SUM(O40:O41)","v":0},"06 Perm m/lønn",{"$f":"X40+AC40*-1","v":0}]
["Ferieregnskap",null,null,"Dager","Timeregnskap",null,null,null,null,null,null,null,null,"Timer",null,"07 Perm u/lønn",{"$f":"Y40+AD40*-1","v":0}]
["Disponible feriedager",null,null,{"$f":"NOV!D47","v":25},"Opptjent denne måneden",null,null,null,null,null,null,null,null,{"$f":"SUM(N9:N39)-AG41-(SUM(K40:M40))+N50","v":0},null,"08 Sykemelding",{"$f":"(Z40+AE40*-1)","v":0}]
["Brukt denne måned",null,null,{"$f":"V40*-1","v":0},"Avspasert denne måneden",null,null,null,null,null,null,null,null,{"$f":"U40","v":0},null,"09 Egenmelding",{"$f":"(AA40+AF40*-1)","v":0}]
["Endring i feriedager",null,null,null,"Utbetalt overtid denne måned",null,null,null,null,null,null,null,null,{"$f":"SUM(K40:M40)","v":0},null,"10 Sykt barn",{"$f":"(AB40+AG40*-1)","v":0}]
["Til gode",null,null,{"$f":"SUM(D44:D46)","v":25},"Til gode for avspasering",null,null,null,null,null,null,null,null,{"$f":"N42","v":0},null,"Sum - Desember",{"$f":"SUM(Q42:Q46)","v":0}]
[null,null,null,null,"Effektiv arbeidstid denne måned",null,null,null,null,null,null,null,null,{"$f":"G40+N44+AG41+N46-N50","v":0},null,"Hittil i år",{"$f":"Q47+NOV!Q48","v":0}]
[null,null,null,null,"Flexitid omgjort til overtid og utbetalt, denne måned"]
[null,null,null,null,"Annen korrigering av flexitid, OBS! skriv egen merknad"]
["Merknader"]
[]
[]
[]
[]
[]
["Overtid for utbetaling:",null,null,null,null,null,"Dato",null,null,null,null,null,null,null,"Dato"]
[null,null,null,"Timer med 50% tillegg :",{"$f":"K40","v":0}]
[null,null,null,"Timer med 100% tillegg:",{"$f":"L40","v":0}]
[null,null,null,"Timer med 133% tillegg:",{"$f":"M39","v":0},null,null,null,"Attestert",null,null,null,null,null,"Anvist"]
[]
[]
[null,null,null,null,null,null,null,null,null,null,null,null,null,null,null,{"$f":"MENY!D6","v":"Leder"}]
["© Ole Jørgen Klaussen - 2003",null,null,null,{"$f":"TODAY()","v":"2018-11-30"},{"$f":"YEAR(TODAY())","v":2018},null,null,null,null,null,null,null,null,null,null,"ole.klaussen@online.no"]

{"sheet":"ÅRET","index":13,"n_rows":38,"n_cols":12,"rows_kept":38,"cut":false,"hidden":false,"merged":[[5,5,5,7]]}
["Meny","Jan","Feb","Mars","April","Mai","Juni"]
["Hjelp","Juli","Aug","Sept","Okt","Nov","Des"]
[{"$f":"TODAY()","v":"2018-11-30"}]
[{"$f":"MENY!D4","v":"Min bedrift"},null,null,"Hele året",{"$f":"MENY!P1","v":2019}]
["Arbeidstaker: ",{"$f":"MENY!D5","v":"Min timeliste"}]
["Timeregnskap","Balanse","Sum for","Avspasering regnskap",null,"Overtid",null,null,"Sum"]
["Overførte dager",{"$f":"MENY!F16","v":0},"Effektiv","Opptjening","Avspasere",0.5,1,1.3332999999999999,"Overtid"]
["Januar",{"$f":"JAN!N40-F8-G8-H8","v":0},{"$f":"JAN!N48","v":0},{"$f":"JAN!N44","v":0},{"$f":"JAN!U40","v":0},{"$f":"JAN!K40","v":0},{"$f":"JAN!L40","v":0},{"$f":"JAN!M40","v":0},{"$f":"SUM(F8:H8)","v":0}]
["Februar",{"$f":"FEB!N40-F9-G9-H9","v":0},{"$f":"FEB!N48","v":0},{"$f":"FEB!N44","v":0},{"$f":"FEB!U40","v":0},{"$f":"FEB!K40","v":0},{"$f":"FEB!L40","v":0},{"$f":"FEB!M40","v":0},{"$f":"SUM(F9:H9)","v":0}]
["Mars",{"$f":"MAR!N40-F10-G10-H10","v":0},{"$f":"MAR!$N$48","v":0},{"$f":"MAR!N44","v":0},{"$f":"MAR!U40","v":0},{"$f":"MAR!K40","v":0},{"$f":"MAR!L40","v":0},{"$f":"MAR!M40","v":0},0]
["April",{"$f":"APR!N40-F11-G11-H11","v":0},{"$f":"APR!N48","v":0},{"$f":"APR!N44","v":0},{"$f":"APR!U40","v":0},{"$f":"APR!K40","v":0},{"$f":"APR!L40","v":0},{"$f":"APR!M40","v":0},0]
["Mai",{"$f":"MAI!N40-F12-G12-H12","v":0},{"$f":"MAI!N48","v":0},{"$f":"MAI!N44","v":0},{"$f":"MAI!U40","v":0},{"$f":"MAI!K40","v":0},{"$f":"MAI!L40","v":0},{"$f":"MAI!M40","v":0},0]
["Juni",{"$f":"JUN!N40-F13-G13-H13","v":0},{"$f":"JUN!N48","v":0},{"$f":"JUN!N44","v":0},{"$f":"JUN!U40","v":0},{"$f":"JUN!K40","v":0},{"$f":"JUN!L40","v":0},{"$f":"JUN!M40","v":0},0]
["Juli",{"$f":"JUL!N40-F14-G14-H14","v":0},{"$f":"JUL!N48","v":0},{"$f":"JUL!N44","v":0},{"$f":"JUL!U40","v":0},{"$f":"JUL!K40","v":0},{"$f":"JUL!L40","v":0},{"$f":"JUL!M40","v":0},0]
["August",{"$f":"AUG!N40-F15-G15-H15","v":0},{"$f":"AUG!N48","v":0},{"$f":"AUG!N44","v":0},{"$f":"AUG!U40","v":0},{"$f":"AUG!K40","v":0},{"$f":"AUG!L40","v":0},{"$f":"AUG!M40","v":0},0]
["September",{"$f":"SEP!N40-F16-G16-H16","v":0},{"$f":"SEP!N48","v":0},{"$f":"SEP!N44","v":0},{"$f":"SEP!U40","v":0},{"$f":"SEP!K40","v":0},{"$f":"SEP!L40","v":0},{"$f":"SEP!M40","v":0},0]
["Oktober",{"$f":"OKT!N40-F17-G17-H17","v":0},{"$f":"OKT!N48","v":0},{"$f":"OKT!N44","v":0},{"$f":"OKT!U40","v":0},{"$f":"OKT!K40","v":0},{"$f":"OKT!L40","v":0},{"$f":"OKT!M40","v":0},0]
["November",{"$f":"NOV!N40-F18-G18-H18","v":0},{"$f":"NOV!N48","v":0},{"$f":"NOV!N44","v":0},{"$f":"NOV!U40","v":0},{"$f":"NOV!K40","v":0},{"$f":"NOV!L40","v":0},{"$f":"NOV!M40","v":0},0]
["Desember",{"$f":"DES!N40-F19-G19-H19","v":0},{"$f":"DES!N48","v":0},{"$f":"DES!N44","v":0},{"$f":"DES!U40","v":0},{"$f":"DES!K40","v":0},{"$f":"DES!L40","v":0},{"$f":"DES!M40","v":0},0]
["Sum for året",{"$f":"SUM(B8:B19)","v":0},0,0,0,0,0,0,0]
["Overføres neste år :",{"$f":"D20-E20+B7","v":0}]
[null,null,null,null,null,null,null,null,"Ferieregnskap ",null,{"$f":"K24","v":2019},"Dager"]
["Fraværersregnskap","Permisjon","Permisjon","Syke","Egen","Sykt",null,null,null,"Overførte dager fra",{"$f":"E4-1","v":2018},{"$f":"MENY!F19","v":0}]
[null,"Med lønn","uten lønn","melding","melding","barn","Sum",null,null,"Opptjent i",{"$f":"K23+1","v":2019},{"$f":"MENY!F20-MENY!F19","v":25}]
["Januar",{"$f":"JAN!Q42","v":0},{"$f":"JAN!Q43","v":0},{"$f":"JAN!Q44","v":0},{"$f":"JAN!Q45","v":0},{"$f":"JAN!Q46","v":0},{"$f":"SUM(B25:F25)","v":0},null,"Ferieuttak",null," Januar  ",{"$f":"JAN!D44-JAN!D47","v":0}]
["Februar",{"$f":"FEB!Q42","v":0},{"$f":"FEB!Q43","v":0},{"$f":"FEB!Q44","v":0},{"$f":"FEB!Q45","v":0},{"$f":"FEB!Q46","v":0},{"$f":"SUM(B26:F26)","v":0},null,null,null,"Februar  ",{"$f":"FEB!D44-FEB!D47","v":0}]
["Mars",{"$f":"MAR!Q42","v":0},{"$f":"MAR!Q43","v":0},{"$f":"MAR!Q44","v":0},{"$f":"MAR!Q45","v":0},{"$f":"MAR!Q46","v":0},0,null,null,null,"Mars  ",{"$f":"MAR!D44-MAR!D47","v":0}]
["April",{"$f":"APR!Q42","v":0},{"$f":"APR!Q43","v":0},{"$f":"APR!Q44","v":0},{"$f":"APR!Q45","v":0},{"$f":"APR!Q46","v":0},0,null,null,null,"April  ",{"$f":"APR!D44-APR!D47","v":0}]
["Mai",{"$f":"MAI!Q42","v":0},{"$f":"MAI!Q43","v":0},{"$f":"MAI!Q44","v":0},{"$f":"MAI!Q45","v":0},{"$f":"MAI!Q46","v":0},0,null,null,null,"Mai  ",{"$f":"MAI!D44-MAI!D47","v":0}]
["Juni",{"$f":"JUN!Q42","v":0},{"$f":"JUN!Q43","v":0},{"$f":"JUN!Q44","v":0},{"$f":"JUN!Q45","v":0},{"$f":"JUN!Q46","v":0},0,null,null,null,"Juni  ",{"$f":"JUN!D44-JUN!D47","v":0}]
["Juli",{"$f":"JUL!Q42","v":0},{"$f":"JUL!Q43","v":0},{"$f":"JUL!Q44","v":0},{"$f":"JUL!Q45","v":0},{"$f":"JUL!Q46","v":0},0,null,null,null,"Juli  ",{"$f":"JUL!D44-JUL!D47","v":0}]
["August",{"$f":"AUG!Q42","v":0},{"$f":"AUG!Q43","v":0},{"$f":"AUG!Q44","v":0},{"$f":"AUG!Q45","v":0},{"$f":"AUG!Q46","v":0},0,null,null,null,"August  ",{"$f":"AUG!D44-AUG!D47","v":0}]
["September",{"$f":"SEP!Q42","v":0},{"$f":"SEP!Q43","v":0},{"$f":"SEP!Q44","v":0},{"$f":"SEP!Q45","v":0},{"$f":"SEP!Q46","v":0},0,null,null,null,"September  ",{"$f":"SEP!D44-SEP!D47","v":0}]
["Oktober",{"$f":"OKT!Q42","v":0},{"$f":"OKT!Q43","v":0},{"$f":"OKT!Q44","v":0},{"$f":"OKT!Q45","v":0},{"$f":"OKT!Q46","v":0},0,null,null,null,"Oktober  ",{"$f":"OKT!D44-OKT!D47","v":0}]
["November",{"$f":"NOV!Q42","v":0},{"$f":"NOV!Q43","v":0},{"$f":"NOV!Q44","v":0},{"$f":"NOV!Q45","v":0},{"$f":"NOV!Q46","v":0},0,null,null,null,"November  ",{"$f":"NOV!D44-NOV!D47","v":0}]
["Desember",{"$f":"DES!Q42","v":0},{"$f":"DES!Q43","v":0},{"$f":"DES!Q44","v":0},{"$f":"DES!Q45","v":0},{"$f":"DES!Q46","v":0},0,null,null,null,"Desember  ",{"$f":"DES!D44-DES!D47","v":0}]
["Sum for året",{"$f":"SUM(B25:B36)","v":0},0,0,0,0,0,null,null,"Forbrukte dager i",{"$f":"K24","v":2019},{"$f":"SUM(L25:L36)","v":0}]
[null,null,null,null,null,null,null,null,null,"Feriedager overføres",{"$f":"K23+2","v":2020},{"$f":"L23+L24-L37","v":25}]

{"sheet":"HJELP","index":14,"n_rows":99,"n_cols":8,"rows_kept":99,"cut":false,"hidden":false,"merged":[]}
[null,"MENY","Januar","Februar","Mars","April","Mai","Juni"]
[null,"Året","Juli","August","September","Oktober","November","Desember"]
[]
[null,"Flexitid, fravær og ferielisteprogram"]
[null,"VIKTIG !"]
[null,"Dette programmet er avhengig av at du har et tillegg under verktøy. Gjør som følger :"]
[null,"1. Klikk for  \"Verktøy\"   2.  Velg  \"Tillegg\"   3. Kryss av for \"Analyseverktøy\" ."]
[null,"4. Når så er installert, avslutt dette regnearket, og start excel på nytt. "]
[null,"Før du kan ta i bruk programmet legger du inn oppstartingsdata som er :"]
[null,1,"Bedriftens navn"]
[null,2,"Året som regnskapet gjelder"]
[null,3,"Ditt navn"]
[null,4,"Trekk for matpause legges inn for både sommer og vinter"]
[null,null,"Dersom du skal trekkes for matpause, husk å oppgi lengden  i format [time]:[minutt]"]
[null,4,"Klokkeslett for arbeidsdagens start og slutt."]
[null,null,"Husk at klokkeslett oppgis med kolon!. Format  [time]:[minutt]"]
[null,5,"Legg inn antall timer du eventuelt skal overføre fra foregående"]
[null,null,"år. Husk at dette tallet oppgis som desimaltall, dvs at f.eks"]
[null,null,"om du har 6 timer og 45 minutter, så oppgis det som 6,75"]
[null,6,"Legg inn om du har noen feriedager som overføres"]
[null,null,"fra forrige år."]
[null,7,"Legg inn start og slutt tidspunkt for sommertid. Dersom din bedrift"]
[null,null,"ikke har sommerlukking. Legg inn 1.1  både som start og slutt."]
[null,8,"Føring av koder for fravær og avspasering etc.  Dette føres med koder i egen kolonne"]
[null,null," \"Arbeids og fraværskode\".   Aktuelle koder er angitt over kolonnen. "]
[null,null,"Ordinær arbeidstid er angitt som  kode \" 0 \" , og er standard for føringen. "]
[null,null,"Kun virkedager kan føres koder. Ved føring på lørdag el. Søndag får sen \"Error\" melding"]
[null,null,"Aktuelle koder :"]
[null,null," 0 = standardkode som foreslås av programmet. Gjelder ordinær arbeidsdag"]
[null,null,"1  = Avspasering, og brukes når det avspaseres hel dag"]
[null,null,"2  = Ferie, og brukes når det tas ut feriedag. Ferieregnskapet vil da oppdateres."]
[null,null,"3  = Tjeneste, brukes som kode for tjenestereiser etc. legg om nødvendig inn tidsreg."]
[null,null,"4 = Plussdag. Brukes for arbeidstakere i deltid som går ekstra dager på jobb."]
[null,null,"5 = Helligdag. Koden brukes for helligdager,  \"Røde kalenderdager\"  på virkedager."]
[null,null,"6 = Perm m/lønn. Brukes når man tar ut permisjon med lønn fra arb. Giver."]
[null,null,"7 = Perm u/lønn. Brukes når man tar ut permisjon uten lønn fra arbeidsgiver."]
[null,null,"8 = Sykemelding. Brukes når man har sykemelding fra lege etc."]
[null,null,"9 = Egenmelding. Brukes når man har levert egenmelding for sykdom/fravær."]
[null,null,"10 = Sykt barn. Brukes kun når man melder fra å være hjemme med sykt barn."]
[null,null,"11= Ordinær + . Koden brukes kun når du har en ordinær arbeidsdag som i tid fraviker"]
[null,null,"       fra den vanlige ordinærtiden. Som f.eks  dersom du har redusert tid Juleaften osv."]
[null,9,"Deltidsfravær  pr dag"]
[null,null,"Dette anmerkes i egen fraværskolonne merket \"Fravær\", se også notat-tekst"]
[null,null,"Ved deltidsfravær legges inn som vanlig når man kommer (inn) og når man går (ut).  "]
[null,null,"Dersom man da er sykemeldt deler av dagen, kan  minustiden omdirigeres "]
[null,null,"fra  flexitiden til fravær ved å legge inn kode i  kolonne for deltidsfravær. "]
[null,null,"Gyldige koder er  6, 7, 8, 9 og 10."]
[]
[null,10,"Overtid"]
[null,null,"Modellen har direkte føring av overtid pr dag. Ved bruk av kode 12 som arbeidskode"]
[null,null,"vil overtiden bli beregnet med 4 timer som 50% og overskytende som 100%."]
[null,null,"Alle overtidsføringer kan også endres manuelt (gule felt)"]
[null,null,"man fører  inn  de timer som skal utbetales i overtid."]
[null,null,"Effektiv arbeidstid vil imidlertid være  total arbeidstid på jobb,"]
[null,null,"som også inkluderer utbetalt overtid."]
[null,null,"Dersom flexitid omgjøres til overtid, merkes dette særskilt, og føres direkte til anvisning."]
[null,null,"Bruk merknadsfeltet for å merke for overtid."]
[null,11,"Eventuelle endringer i feriedager kan korrigeres (omgjøringer)"]
[null,null,"Andre endringer i flexitid, eller omgjøring av flex til overtid, gjøres i egen"]
[null,null,"rubrikk, og føres manuelt ned til anvisning"]
[]
[null,12,"Redusert stilling"]
[null,null,"For alle som har fast ansettelse i en stillingsbrøk,   gjelder følgende:"]
[null,null,"Stillingsbrøken legges inn som fast brøk  på MENY arket"]
[null,null,"Arbeidstid blir så fordelt  med like timer for alle dager i arbeidsuka."]
[null,null,"Da gjelder videre at det også må føres timer for alle dager.  "]
[null,null,"F.eks  dersom en  med 80% stilling skal arbeide bare 4 dagers uke, føres klokkeslett"]
[null,null,"som INN og UT  på vanlig måte for de 4 dagene.  Det blir så opptjent  avspasering og"]
[null,null,"for den 5. arbeidsdagen  må det legges inn avspasering med kode 1"]
[null,null,"Totalt vil da timetallet bli korrekt for hver uke. "]
[null,null,"Systemet fungerer  på denne måten korrekt, uansett om redusert arbeidstid tas ut som"]
[null,null,"færrre arbeidsdager pr uke, eller  om at  den reduserte arbeidstiden "]
[null,null,"fordeles på alle dager i uken."]
[null,null,"Blir det endring i løpet av året i  stillinsbrøk,  så legges denne endringen inn i "]
[null,null,"timeføringsarket i kolonne helt til høyre.  Endringen legges \"fra og med dato\", og vil"]
[null,null,"bli automatisk videreført for resten av året.   OBS!  Ikke gjør endringen i MENY arket, "]
[null,null,"der skal stillinsbrøken være slik den var ved starten av året."]
[null,13,"Deltids sykemelding"]
[null,null,"Er  du sykemeldt i en prosent-andel,  så legges denne prosenten inn dag for dag"]
[null,null,"i kolonne  til høyre i  timeføringsarket. "]
[null,null,"Innlegging gjøres slik at du legger inn den aktuelle prosentandel på  \"fra og med dag\""]
[null,null,"Prosentandelen vil da automatisk bli videreført for resten av året.  For å gå tilbake til "]
[null,null,"normal arbeidstid når du er friskemeldt,  så gå inn i aktuell dag og celle, og slett "]
[null,null,"prosentandelen.  Prosentandelen vil da bli slettet for resten av året."]
[]
[null,null,"Når du er deltidsykemeldt,  fordeles arbeidstiden på alle arbeidsdager i uken. "]
[null,null,"Dersom du velger å jobbe full dag noen dager, for å ha fri andre dager,  "]
[null,null,"må du føre for alle dager.  Når du er på jobb føres  INN tid og UT tid som vanlig, "]
[null,null,"og for de dager du er hjemme fører du da avspasering.   Systemet  vil  dermed"]
[null,null,"fordele timene over uken,   se også  forrige punkt  12. "]
[]
[null,"Alle gule felt i programmet kan fylles ut. "]
[null,"Husk at ved føring av timelistene så oppgis alle klokkeslett med KOLON"]
[null,"som skille tegn i formatet  [timer] : [minutter]"]
[null,"OBS! Uttak av avspasering og feriedager kan bare gjøres på vanlige ukedager."]
[null,"Forsøker du å merke slikt uttak på lørdag og søndag, får du en ERROR melding"]
[null,"Tjenestereiser merkes med nr 3. Legg merke til at det ikke lar seg gjøre å tjene opp"]
[null,"avspasering ved tjenestereise.  Dersom du får overtid på tjenestereise må overtid avtales"]
[null,"med arbeidsgiver i det enkelte tilfelle.  Dette er i henhold til standard reglementer."]